television show
type: Class
label: émission de télévision @fr

park
label: parc @fr
type: Class

brain
type: Class
label: cerveau @fr

disease
type: Class
label: maladie @fr

has Reptile
range: reptile
domain: flowering plant
comment: Relazione tra Flowering Plant e Reptile @it
comment: Relation between Flowering Plant and Reptile
type: ObjectProperty

has Crustacean
domain: flowering plant
type: ObjectProperty
comment: Relation between Flowering Plant and Crustacean
comment: Relazione tra Flowering Plant e Crustacean @it
range: crustacean

Ontology
has intent: To represent the encyclopedic knowledge expressed by an object typed as FloweringPlant
comment: FloweringPlant Encyclopedic Knowledge Pattern
has author: Aldo Gangemi
extracted from: en.wikipedia.org
imports: cpannotationschema.owl
extracted from: dbpedia.org
has author: Valentina Presutti
has author: Andrea Giovanni Nuzzolese

has Conifer
comment: Relation between Flowering Plant and Conifer
type: ObjectProperty
comment: Relazione tra Flowering Plant e Conifer @it
domain: flowering plant
range: conifer

has Canadian Football Team
comment: Relazione tra Flowering Plant e Canadian Football Team @it
range: canadian football team
type: ObjectProperty
comment: Relation between Flowering Plant and Canadian Football Team
domain: flowering plant

actor
label: acteur @fr
type: Class
label: Schauspieler @de

has Park
comment: Relazione tra Flowering Plant e Park @it
domain: flowering plant
comment: Relation between Flowering Plant and Park
range: park
type: ObjectProperty

has Television Episode
type: ObjectProperty
comment: Relation between Flowering Plant and Television Episode
range: television episode
comment: Relazione tra Flowering Plant e Television Episode @it
domain: flowering plant

stadium
type: Class
label: stade @fr

has Music Genre
type: ObjectProperty
comment: Relation between Flowering Plant and Music Genre
range: music genre
comment: Relazione tra Flowering Plant e Music Genre @it
domain: flowering plant

has Comics Character
domain: flowering plant
comment: Relazione tra Flowering Plant e Comics Character @it
comment: Relation between Flowering Plant and Comics Character
type: ObjectProperty
range: comics character

has Road
comment: Relazione tra Flowering Plant e Road @it
range: road
domain: flowering plant
comment: Relation between Flowering Plant and Road
type: ObjectProperty

Site of Special Scientific Interest
type: Class
label: site d'intérêt scientifique particulier @fr

has Game
comment: Relazione tra Flowering Plant e Game @it
domain: flowering plant
type: ObjectProperty
comment: Relation between Flowering Plant and Game
range: game

criminal
type: Class
label: criminel @fr

has College
comment: Relation between Flowering Plant and College
type: ObjectProperty
comment: Relazione tra Flowering Plant e College @it
range: college
domain: flowering plant

has Actor
type: ObjectProperty
range: actor
comment: Relazione tra Flowering Plant e Actor @it
domain: flowering plant
comment: Relation between Flowering Plant and Actor

amphibian
type: Class
label: amphibien @fr

flowering plant
label: angiospermes @fr
type: Class

senator
type: Class
label: sénateur @fr

has Comics Creator
comment: Relazione tra Flowering Plant e Comics Creator @it
range: comics creator
type: ObjectProperty
domain: flowering plant
comment: Relation between Flowering Plant and Comics Creator

valley
label: vallée @fr
type: Class

has Bird
type: ObjectProperty
range: bird
comment: Relation between Flowering Plant and Bird
domain: flowering plant
comment: Relazione tra Flowering Plant e Bird @it

has School
domain: flowering plant
comment: Relazione tra Flowering Plant e School @it
range: school
type: ObjectProperty
comment: Relation between Flowering Plant and School

has Soccer Club
domain: flowering plant
comment: Relation between Flowering Plant and Soccer Club
range: soccer club
type: ObjectProperty
comment: Relazione tra Flowering Plant e Soccer Club @it

newspaper
type: Class
label: journal @fr

has Senator
comment: Relation between Flowering Plant and Senator
type: ObjectProperty
domain: flowering plant
range: senator
comment: Relazione tra Flowering Plant e Senator @it

game
type: Class
label: jeu @fr

protected area
type: Class
label: προστατευμένη περιοχή @el
label: aire protégée @fr

road
type: Class
label: route @fr

has Valley
domain: flowering plant
comment: Relazione tra Flowering Plant e Valley @it
comment: Relation between Flowering Plant and Valley
range: valley
type: ObjectProperty

ginkgo
type: Class

has Currency
type: ObjectProperty
comment: Relation between Flowering Plant and Currency
range: currency
domain: flowering plant
comment: Relazione tra Flowering Plant e Currency @it

bacteria
type: Class
label: bactérie @fr

has Embryology
comment: Relation between Flowering Plant and Embryology
comment: Relazione tra Flowering Plant e Embryology @it
type: ObjectProperty
range: embryology
domain: flowering plant

non-profit organisation
type: Class
label: organisation à but non lucratif @fr

has Film
domain: flowering plant
comment: Relazione tra Flowering Plant e Film @it
range: film
type: ObjectProperty
comment: Relation between Flowering Plant and Film

canadian football league
type: Class

mollusca
label: mollusque @fr
type: Class

has Mollusca
domain: flowering plant
comment: Relation between Flowering Plant and Mollusca
range: mollusca
type: ObjectProperty
comment: Relazione tra Flowering Plant e Mollusca @it

arachnid
type: Class
label: arachnides @fr

has Member Of Parliament
type: ObjectProperty
comment: Relation between Flowering Plant and Member Of Parliament
domain: flowering plant
comment: Relazione tra Flowering Plant e Member Of Parliament @it
range: member of parliament

weapon
type: Class
label: arme @fr

has Television Show
type: ObjectProperty
comment: Relazione tra Flowering Plant e Television Show @it
domain: flowering plant
comment: Relation between Flowering Plant and Television Show
range: television show

has Arachnid
range: arachnid
domain: flowering plant
type: ObjectProperty
comment: Relation between Flowering Plant and Arachnid
comment: Relazione tra Flowering Plant e Arachnid @it

governor
label: gouverneur @fr
type: Class

drug
type: Class
label: médicament @fr

has Artery
range: artery
domain: flowering plant
type: ObjectProperty
comment: Relation between Flowering Plant and Artery
comment: Relazione tra Flowering Plant e Artery @it

has Website
comment: Relazione tra Flowering Plant e Website @it
domain: flowering plant
type: ObjectProperty
range: website
comment: Relation between Flowering Plant and Website

magazine
label: περιοδικό @el
type: Class

school
label: école @fr
type: Class

ship
label: navire @fr
type: Class

museum
type: Class
label: musée @fr

fish
label: poisson @fr
type: Class

has Weapon
comment: Relazione tra Flowering Plant e Weapon @it
range: weapon
comment: Relation between Flowering Plant and Weapon
domain: flowering plant
type: ObjectProperty

has Bone
type: ObjectProperty
comment: Relation between Flowering Plant and Bone
domain: flowering plant
range: bone
comment: Relazione tra Flowering Plant e Bone @it

has Single
range: single
comment: Relation between Flowering Plant and Single
domain: flowering plant
comment: Relazione tra Flowering Plant e Single @it
type: ObjectProperty

video game
type: Class
label: jeux vidéo @fr

canal
type: Class

military person
type: Class
label: militaire @fr

award
type: Class
label: récompense @fr

currency
label: devise @fr
type: Class

historic place
type: Class
label: site historique @fr

hospital
label: hôpital @fr
type: Class

college
type: Class

sport
type: Class

has Museum
comment: Relazione tra Flowering Plant e Museum @it
range: museum
domain: flowering plant
type: ObjectProperty
comment: Relation between Flowering Plant and Museum

has Disease
comment: Relazione tra Flowering Plant e Disease @it
type: ObjectProperty
comment: Relation between Flowering Plant and Disease
domain: flowering plant
range: disease

nerve
type: Class
label: nerf @fr

single
type: Class

has Broadcast
comment: Relazione tra Flowering Plant e Broadcast @it
range: broadcast
domain: flowering plant
comment: Relation between Flowering Plant and Broadcast
type: ObjectProperty

Band
label: groupe de musique @fr
type: Class
label: Musikgruppe @de
label: banda @pt

has Video Game
domain: flowering plant
type: ObjectProperty
comment: Relazione tra Flowering Plant e Video Game @it
range: video game
comment: Relation between Flowering Plant and Video Game

has Canadian Football League
range: canadian football league
domain: flowering plant
comment: Relation between Flowering Plant and Canadian Football League
comment: Relazione tra Flowering Plant e Canadian Football League @it
type: ObjectProperty

has Military Person
domain: flowering plant
type: ObjectProperty
comment: Relazione tra Flowering Plant e Military Person @it
range: military person
comment: Relation between Flowering Plant and Military Person

has Canal
domain: flowering plant
comment: Relazione tra Flowering Plant e Canal @it
comment: Relation between Flowering Plant and Canal
range: canal
type: ObjectProperty

has Congressman
type: ObjectProperty
domain: flowering plant
comment: Relation between Flowering Plant and Congressman
comment: Relazione tra Flowering Plant e Congressman @it
range: congressman

has Ginkgo
domain: flowering plant
range: ginkgo
type: ObjectProperty
comment: Relation between Flowering Plant and Ginkgo
comment: Relazione tra Flowering Plant e Ginkgo @it

has Airline
range: airline
comment: Relation between Flowering Plant and Airline
domain: flowering plant
comment: Relazione tra Flowering Plant e Airline @it
type: ObjectProperty

artery
label: Arterie @de
type: Class
label: artère @fr

has Supreme Court Of The United States Case
range: Supreme Court of the United States case
type: ObjectProperty
domain: flowering plant
comment: Relazione tra Flowering Plant e Supreme Court Of The United States Case @it
comment: Relation between Flowering Plant and Supreme Court Of The United States Case

embryology
label: embryologie @fr
type: Class

album
label: Album @de
type: Class

moss
label: mousses @fr
type: Class

has Musical Artist
comment: Relation between Flowering Plant and Musical Artist
type: ObjectProperty
comment: Relazione tra Flowering Plant e Musical Artist @it
domain: flowering plant
range: musical artist

military unit
label: unité militaire @fr
type: Class

has Planet
comment: Relazione tra Flowering Plant e Planet @it
comment: Relation between Flowering Plant and Planet
type: ObjectProperty
domain: flowering plant
range: planet

has Club Moss
comment: Relazione tra Flowering Plant e Club Moss @it
comment: Relation between Flowering Plant and Club Moss
type: ObjectProperty
range: club moss
domain: flowering plant

television episode
label: épisode télévisé @fr
type: Class

has Olympics
comment: Relation between Flowering Plant and Olympics
domain: flowering plant
type: ObjectProperty
range: olympics
comment: Relazione tra Flowering Plant e Olympics @it

has Amphibian
domain: flowering plant
comment: Relation between Flowering Plant and Amphibian
range: amphibian
type: ObjectProperty
comment: Relazione tra Flowering Plant e Amphibian @it

village
label: χωριό @el
type: Class

canadian football team
type: Class
label: équipe canadienne de football américain @fr

soccer club
type: Class
label: club de football @fr

has Nerve
range: nerve
domain: flowering plant
type: ObjectProperty
comment: Relation between Flowering Plant and Nerve
comment: Relazione tra Flowering Plant e Nerve @it

has Fish
comment: Relation between Flowering Plant and Fish
type: ObjectProperty
domain: flowering plant
range: fish
comment: Relazione tra Flowering Plant e Fish @it

music genre
type: Class
label: género musical @pt
label: genre musical @fr

has Village
domain: flowering plant
comment: Relazione tra Flowering Plant e Village @it
comment: Relation between Flowering Plant and Village
type: ObjectProperty
range: village

has Governor
type: ObjectProperty
domain: flowering plant
range: governor
comment: Relazione tra Flowering Plant e Governor @it
comment: Relation between Flowering Plant and Governor

has Lighthouse
domain: flowering plant
range: lighthouse
type: ObjectProperty
comment: Relation between Flowering Plant and Lighthouse
comment: Relazione tra Flowering Plant e Lighthouse @it

website
label: site web @fr
label: Ιστότοπος @el
type: Class

has American Football Team
domain: flowering plant
range: american football team
comment: Relation between Flowering Plant and American Football Team
comment: Relazione tra Flowering Plant e American Football Team @it
type: ObjectProperty

has Sport
domain: flowering plant
comment: Relazione tra Flowering Plant e Sport @it
type: ObjectProperty
comment: Relation between Flowering Plant and Sport
range: sport

crustacean
type: Class
label: crustacés @fr

has Legislature
range: legislature
comment: Relazione tra Flowering Plant e Legislature @it
type: ObjectProperty
comment: Relation between Flowering Plant and Legislature
domain: flowering plant

has Ice Hockey Player
range: ice hockey player
type: ObjectProperty
comment: Relation between Flowering Plant and Ice Hockey Player
comment: Relazione tra Flowering Plant e Ice Hockey Player @it
domain: flowering plant

has Magazine
comment: Relation between Flowering Plant and Magazine
type: ObjectProperty
comment: Relazione tra Flowering Plant e Magazine @it
range: magazine
domain: flowering plant

has Newspaper
type: ObjectProperty
comment: Relation between Flowering Plant and Newspaper
comment: Relazione tra Flowering Plant e Newspaper @it
range: newspaper
domain: flowering plant

ice hockey player
label: joueur de hockey sur glace @fr
type: Class

has Band
range: Band
type: ObjectProperty
domain: flowering plant
comment: Relation between Flowering Plant and Band
comment: Relazione tra Flowering Plant e Band @it

has Military Unit
type: ObjectProperty
comment: Relazione tra Flowering Plant e Military Unit @it
comment: Relation between Flowering Plant and Military Unit
range: military unit
domain: flowering plant

lighthouse
type: Class
label: phare @fr

comics creator
type: Class
label: créateur de bandes dessinées @fr

aircraft
label: avion @fr
type: Class
label: αεροσκάφος @el

planet
label: planète @fr
type: Class

has Criminal
comment: Relation between Flowering Plant and Criminal
range: criminal
type: ObjectProperty
domain: flowering plant
comment: Relazione tra Flowering Plant e Criminal @it

club moss
label: lycopodiopsida @fr
type: Class

has Non- Profit Organisation
comment: Relation between Flowering Plant and Non- Profit Organisation
comment: Relazione tra Flowering Plant e Non- Profit Organisation @it
domain: flowering plant
type: ObjectProperty
range: non-profit organisation

has Historic Place
comment: Relation between Flowering Plant and Historic Place
type: ObjectProperty
range: historic place
domain: flowering plant
comment: Relazione tra Flowering Plant e Historic Place @it

reptile
type: Class

legislature
type: Class
label: pouvoir législatif @fr

has Album
domain: flowering plant
type: ObjectProperty
range: album
comment: Relation between Flowering Plant and Album
comment: Relazione tra Flowering Plant e Album @it

airline
label: compagnie aérienne @fr
type: Class

olympics
label: Jeux Olympiques @fr
type: Class

has Brain
domain: flowering plant
range: brain
comment: Relazione tra Flowering Plant e Brain @it
type: ObjectProperty
comment: Relation between Flowering Plant and Brain

has Bridge
domain: flowering plant
type: ObjectProperty
comment: Relation between Flowering Plant and Bridge
comment: Relazione tra Flowering Plant e Bridge @it
range: bridge

congressman
label: membre du Congrès @fr
type: Class

bridge
label: pont @fr
type: Class

has Protected Area
range: protected area
domain: flowering plant
comment: Relazione tra Flowering Plant e Protected Area @it
comment: Relation between Flowering Plant and Protected Area
type: ObjectProperty

broadcast
label: Émission de télévision @fr
type: Class

film
label: ταινία @el
type: Class

has Drug
type: ObjectProperty
domain: flowering plant
comment: Relazione tra Flowering Plant e Drug @it
comment: Relation between Flowering Plant and Drug
range: drug

american football team
label: équipe américaine de football américain @fr
type: Class

has Moss
type: ObjectProperty
range: moss
comment: Relation between Flowering Plant and Moss
domain: flowering plant
comment: Relazione tra Flowering Plant e Moss @it

comics character
label: personnage de bandes dessinées @fr
type: Class

has Stadium
type: ObjectProperty
domain: flowering plant
comment: Relation between Flowering Plant and Stadium
comment: Relazione tra Flowering Plant e Stadium @it
range: stadium

has Hospital
range: hospital
comment: Relation between Flowering Plant and Hospital
type: ObjectProperty
domain: flowering plant
comment: Relazione tra Flowering Plant e Hospital @it

Supreme Court of the United States case
label: cas juridique de la Cour suprême des États-Unis @fr
type: Class

has Ship
comment: Relation between Flowering Plant and Ship
comment: Relazione tra Flowering Plant e Ship @it
range: ship
type: ObjectProperty
domain: flowering plant

has Fern
domain: flowering plant
comment: Relazione tra Flowering Plant e Fern @it
range: fern
comment: Relation between Flowering Plant and Fern
type: ObjectProperty

bird
type: Class
label: oiseau @fr

has Bacteria
range: bacteria
domain: flowering plant
comment: Relazione tra Flowering Plant e Bacteria @it
comment: Relation between Flowering Plant and Bacteria
type: ObjectProperty

has Site Of Special Scientific Interest
comment: Relazione tra Flowering Plant e Site Of Special Scientific Interest @it
range: Site of Special Scientific Interest
comment: Relation between Flowering Plant and Site Of Special Scientific Interest
type: ObjectProperty
domain: flowering plant

bone
type: Class
label: Knochen @de
label: os @fr

member of parliament
label: membre du Parlement @fr
type: Class

fern
type: Class
label: fougères @fr

musical artist
label: artista musical @pt
type: Class
label: musicien @fr

has Aircraft
range: aircraft
comment: Relation between Flowering Plant and Aircraft
domain: flowering plant
type: ObjectProperty
comment: Relazione tra Flowering Plant e Aircraft @it

has Award
comment: Relation between Flowering Plant and Award
range: award
domain: flowering plant
comment: Relazione tra Flowering Plant e Award @it
type: ObjectProperty

conifer
type: Class
label: conifères @fr