has Rugby Player
comment: Relazione tra Formula One Racer e Rugby Player @it
range: rugby player
domain: Formula One racer
type: ObjectProperty
comment: Relation between Formula One Racer and Rugby Player

has Sport
range: sport
type: ObjectProperty
domain: Formula One racer
comment: Relazione tra Formula One Racer e Sport @it
comment: Relation between Formula One Racer and Sport

has Soccer Player
related match: after
range: soccer player
comment: Relation between Formula One Racer and Soccer Player
comment: Relazione tra Formula One Racer e Soccer Player @it
domain: Formula One racer
type: ObjectProperty

has Race
comment: Relation between Formula One Racer and Race
type: ObjectProperty
domain: Formula One racer
range: race
comment: Relazione tra Formula One Racer e Race @it

television show
label: émission de télévision @fr
type: Class

park
type: Class
label: parc @fr

has Member Of Parliament
type: ObjectProperty
comment: Relation between Formula One Racer and Member Of Parliament
domain: Formula One racer
comment: Relazione tra Formula One Racer e Member Of Parliament @it
range: member of parliament

disease
type: Class
label: maladie @fr

has Magazine
type: ObjectProperty
domain: Formula One racer
comment: Relation between Formula One Racer and Magazine
comment: Relazione tra Formula One Racer e Magazine @it
range: magazine

rugby player
type: Class
label: joueur de rugby @fr

has Disease
domain: Formula One racer
comment: Relation between Formula One Racer and Disease
type: ObjectProperty
comment: Relazione tra Formula One Racer e Disease @it
range: disease

has Golf Player
domain: Formula One racer
comment: Relation between Formula One Racer and Golf Player
type: ObjectProperty
comment: Relazione tra Formula One Racer e Golf Player @it
range: golf player

has School
comment: Relation between Formula One Racer and School
domain: Formula One racer
range: school
type: ObjectProperty
comment: Relazione tra Formula One Racer e School @it

Axiom
annotated source: has British Royalty
matching quantification: 1
annotated target: before

Election
label: élection @fr
type: Class

actor
label: Schauspieler @de
type: Class
label: acteur @fr

has Park
range: park
type: ObjectProperty
comment: Relazione tra Formula One Racer e Park @it
domain: Formula One racer
comment: Relation between Formula One Racer and Park

cyclist
type: Class
label: cycliste @fr

has Journalist
domain: Formula One racer
type: ObjectProperty
range: journalist
comment: Relazione tra Formula One Racer e Journalist @it
comment: Relation between Formula One Racer and Journalist

stadium
label: stade @fr
type: Class

has Military Person
type: ObjectProperty
range: military person
comment: Relation between Formula One Racer and Military Person
domain: Formula One racer
comment: Relazione tra Formula One Racer e Military Person @it

has Ice Hockey Player
comment: Relazione tra Formula One Racer e Ice Hockey Player @it
domain: Formula One racer
comment: Relation between Formula One Racer and Ice Hockey Player
range: ice hockey player
type: ObjectProperty

astronaut
label: astronaute @fr
label: Astronaut @de
type: Class

has Prime Minister
comment: Relation between Formula One Racer and Prime Minister
domain: Formula One racer
comment: Relazione tra Formula One Racer e Prime Minister @it
type: ObjectProperty
range: prime minister

has Cyclist
related match: after
related match: before
domain: Formula One racer
comment: Relation between Formula One Racer and Cyclist
range: cyclist
type: ObjectProperty
comment: Relazione tra Formula One Racer e Cyclist @it

Axiom
annotated target: after
matching quantification: 1
annotated source: has Soccer Player

has Town
comment: Relazione tra Formula One Racer e Town @it
range: town
type: ObjectProperty
domain: Formula One racer
comment: Relation between Formula One Racer and Town

has Ski Area
comment: Relazione tra Formula One Racer e Ski Area @it
comment: Relation between Formula One Racer and Ski Area
domain: Formula One racer
range: ski area
type: ObjectProperty

has Chemical Compound
type: ObjectProperty
domain: Formula One racer
comment: Relazione tra Formula One Racer e Chemical Compound @it
range: chemical compound
comment: Relation between Formula One Racer and Chemical Compound

mountain
label: Βουνό @el
label: montagne @fr
type: Class

Site of Special Scientific Interest
label: site d'intérêt scientifique particulier @fr
type: Class

wrestler
type: Class
label: lutteur @fr

criminal
type: Class
label: criminel @fr

has Bone
range: bone
comment: Relation between Formula One Racer and Bone
type: ObjectProperty
domain: Formula One racer
comment: Relazione tra Formula One Racer e Bone @it

Axiom
annotated source: has Soccer Manager
annotated target: before
matching quantification: 1

comedian
label: comédien @fr
type: Class

newspaper
label: journal @fr
type: Class

has Military Conflict
range: military conflict
type: ObjectProperty
comment: Relation between Formula One Racer and Military Conflict
comment: Relazione tra Formula One Racer e Military Conflict @it
domain: Formula One racer

protected area
type: Class
label: προστατευμένη περιοχή @el
label: aire protégée @fr

Playboy Playmate
label: playmate pour Playboy @fr
type: Class

has Mountain
type: ObjectProperty
comment: Relation between Formula One Racer and Mountain
comment: Relazione tra Formula One Racer e Mountain @it
range: mountain
domain: Formula One racer

boxer
type: Class
label: boxeur @fr

book
label: llibre @ca
label: książka @pl
label: βιβλίο @el
label: livre @fr
type: Class

has Legislature
comment: Relazione tra Formula One Racer e Legislature @it
comment: Relation between Formula One Racer and Legislature
domain: Formula One racer
type: ObjectProperty
range: legislature

has Soccer Club
comment: Relation between Formula One Racer and Soccer Club
domain: Formula One racer
type: ObjectProperty
range: soccer club
comment: Relazione tra Formula One Racer e Soccer Club @it

gridiron football player
label: joueur de football américain gridiron @fr
type: Class

language
label: langage @fr
type: Class

has Protected Area
comment: Relazione tra Formula One Racer e Protected Area @it
domain: Formula One racer
range: protected area
type: ObjectProperty
comment: Relation between Formula One Racer and Protected Area

has Tennis Player
range: tennis player
comment: Relazione tra Formula One Racer e Tennis Player @it
comment: Relation between Formula One Racer and Tennis Player
type: ObjectProperty
domain: Formula One racer

ski area
type: Class
label: domaine skiable @fr

non-profit organisation
type: Class
label: organisation à but non lucratif @fr

lake
type: Class
label: lac @fr

has Non- Profit Organisation
comment: Relazione tra Formula One Racer e Non- Profit Organisation @it
comment: Relation between Formula One Racer and Non- Profit Organisation
type: ObjectProperty
range: non-profit organisation
domain: Formula One racer

has Astronaut
comment: Relazione tra Formula One Racer e Astronaut @it
type: ObjectProperty
domain: Formula One racer
comment: Relation between Formula One Racer and Astronaut
range: astronaut

has Wrestler
comment: Relation between Formula One Racer and Wrestler
comment: Relazione tra Formula One Racer e Wrestler @it
type: ObjectProperty
range: wrestler
domain: Formula One racer

has Website
type: ObjectProperty
comment: Relation between Formula One Racer and Website
comment: Relazione tra Formula One Racer e Website @it
range: website
domain: Formula One racer

Axiom
annotated source: has Cyclist
matching quantification: 1
annotated target: after

has Hospital
range: hospital
type: ObjectProperty
domain: Formula One racer
comment: Relazione tra Formula One Racer e Hospital @it
comment: Relation between Formula One Racer and Hospital

weapon
label: arme @fr
type: Class

has Mountain Range
comment: Relation between Formula One Racer and Mountain Range
range: mountain range
type: ObjectProperty
domain: Formula One racer
comment: Relazione tra Formula One Racer e Mountain Range @it

has Scientist
domain: Formula One racer
comment: Relazione tra Formula One Racer e Scientist @it
type: ObjectProperty
range: scientist
comment: Relation between Formula One Racer and Scientist

has Lake
comment: Relazione tra Formula One Racer e Lake @it
range: lake
comment: Relation between Formula One Racer and Lake
type: ObjectProperty
domain: Formula One racer

has Monarch
comment: Relation between Formula One Racer and Monarch
comment: Relazione tra Formula One Racer e Monarch @it
type: ObjectProperty
range: monarch
domain: Formula One racer

has Village
range: village
comment: Relation between Formula One Racer and Village
domain: Formula One racer
comment: Relazione tra Formula One Racer e Village @it
type: ObjectProperty

has Olympics
comment: Relazione tra Formula One Racer e Olympics @it
domain: Formula One racer
type: ObjectProperty
comment: Relation between Formula One Racer and Olympics
range: olympics

has Gridiron Football Player
type: ObjectProperty
range: gridiron football player
comment: Relation between Formula One Racer and Gridiron Football Player
domain: Formula One racer
comment: Relazione tra Formula One Racer e Gridiron Football Player @it

has Election
type: ObjectProperty
domain: Formula One racer
comment: Relation between Formula One Racer and Election
range: Election
comment: Relazione tra Formula One Racer e Election @it

magazine
type: Class
label: περιοδικό @el

school
label: école @fr
type: Class

ship
type: Class
label: navire @fr

museum
label: musée @fr
type: Class

tennis player
type: Class
label: joueur de tennis @fr

video game
type: Class
label: jeux vidéo @fr

has Film
comment: Relazione tra Formula One Racer e Film @it
comment: Relation between Formula One Racer and Film
type: ObjectProperty
domain: Formula One racer
range: film

canal
type: Class

military person
label: militaire @fr
type: Class

has Motorcycle Racing League
domain: Formula One racer
comment: Relation between Formula One Racer and Motorcycle Racing League
range: motorcycle racing league
type: ObjectProperty
comment: Relazione tra Formula One Racer e Motorcycle Racing League @it

philosopher
type: Class
label: philosophe @fr

currency
type: Class
label: devise @fr

award
label: récompense @fr
type: Class

has Site Of Special Scientific Interest
range: Site of Special Scientific Interest
domain: Formula One racer
type: ObjectProperty
comment: Relation between Formula One Racer and Site Of Special Scientific Interest
comment: Relazione tra Formula One Racer e Site Of Special Scientific Interest @it

has Criminal
domain: Formula One racer
comment: Relation between Formula One Racer and Criminal
comment: Relazione tra Formula One Racer e Criminal @it
range: criminal
type: ObjectProperty

prime minister
label: premier ministre @fr
type: Class

British royalty
type: Class
label: royauté Britannique @fr

race
type: Class
label: course @fr

has Television Show
domain: Formula One racer
comment: Relation between Formula One Racer and Television Show
range: television show
comment: Relazione tra Formula One Racer e Television Show @it
type: ObjectProperty

historic place
label: site historique @fr
type: Class

hospital
type: Class
label: hôpital @fr

has Airline
comment: Relation between Formula One Racer and Airline
range: airline
type: ObjectProperty
comment: Relazione tra Formula One Racer e Airline @it
domain: Formula One racer

sport
type: Class

cricketer
type: Class
label: joueur de cricket @fr

automobile engine
type: Class
label: moteur d'automobile @fr

single
type: Class

has Automobile Engine
domain: Formula One racer
comment: Relazione tra Formula One Racer e Automobile Engine @it
type: ObjectProperty
comment: Relation between Formula One Racer and Automobile Engine
range: automobile engine

Band
label: banda @pt
label: Musikgruppe @de
type: Class
label: groupe de musique @fr

has Plant
type: ObjectProperty
range: plant
domain: Formula One racer
comment: Relation between Formula One Racer and Plant
comment: Relazione tra Formula One Racer e Plant @it

town
label: ville @fr
type: Class

has Boxer
comment: Relation between Formula One Racer and Boxer
type: ObjectProperty
comment: Relazione tra Formula One Racer e Boxer @it
range: boxer
domain: Formula One racer

university
type: Class
label: université @fr
label: πανεπιστήμιο @el

has Ship
comment: Relation between Formula One Racer and Ship
domain: Formula One racer
comment: Relazione tra Formula One Racer e Ship @it
type: ObjectProperty
range: ship

continent
label: ήπειρος @el
type: Class

ethnic group
type: Class
label: groupe ethnique @fr

president
type: Class
label: président @fr

album
type: Class
label: Album @de

has Airport
comment: Relation between Formula One Racer and Airport
domain: Formula One racer
range: airport
type: ObjectProperty
comment: Relazione tra Formula One Racer e Airport @it

motorcycle racing league
label: ligue de courses motocycliste @fr
type: Class

has Historic Place
comment: Relation between Formula One Racer and Historic Place
type: ObjectProperty
domain: Formula One racer
comment: Relazione tra Formula One Racer e Historic Place @it
range: historic place

has Album
range: album
type: ObjectProperty
comment: Relation between Formula One Racer and Album
domain: Formula One racer
comment: Relazione tra Formula One Racer e Album @it

has Currency
comment: Relation between Formula One Racer and Currency
comment: Relazione tra Formula One Racer e Currency @it
type: ObjectProperty
domain: Formula One racer
range: currency

has Island
type: ObjectProperty
domain: Formula One racer
comment: Relazione tra Formula One Racer e Island @it
comment: Relation between Formula One Racer and Island
range: island

hotel
label: hôtel @fr
type: Class

has President
comment: Relation between Formula One Racer and President
domain: Formula One racer
comment: Relazione tra Formula One Racer e President @it
range: president
type: ObjectProperty

military unit
label: unité militaire @fr
type: Class

has Basketball Player
range: basketball player
domain: Formula One racer
comment: Relazione tra Formula One Racer e Basketball Player @it
comment: Relation between Formula One Racer and Basketball Player
type: ObjectProperty

has Office Holder
comment: Relazione tra Formula One Racer e Office Holder @it
domain: Formula One racer
type: ObjectProperty
range: office holder
comment: Relation between Formula One Racer and Office Holder
related match: successor

soccer manager
label: entraîneur de football @fr
type: Class

village
type: Class
label: χωριό @el

Ontology
extracted from: en.wikipedia.org
has intent: To represent the encyclopedic knowledge expressed by an object typed as FormulaOneRacer
extracted from: dbpedia.org
has author: Andrea Giovanni Nuzzolese
imports: cpannotationschema.owl
has author: Valentina Presutti
comment: FormulaOneRacer Encyclopedic Knowledge Pattern
has author: Aldo Gangemi

has Military Unit
range: military unit
domain: Formula One racer
type: ObjectProperty
comment: Relazione tra Formula One Racer e Military Unit @it
comment: Relation between Formula One Racer and Military Unit

soccer club
label: club de football @fr
type: Class

has Philosopher
range: philosopher
type: ObjectProperty
comment: Relazione tra Formula One Racer e Philosopher @it
domain: Formula One racer
comment: Relation between Formula One Racer and Philosopher

has Radio Station
comment: Relazione tra Formula One Racer e Radio Station @it
type: ObjectProperty
comment: Relation between Formula One Racer and Radio Station
range: radio station
domain: Formula One racer

writer
type: Class
label: écrivain @fr

office holder
label: titulaire @fr
label: Amtsinhaber @de
type: Class

military conflict
label: conflit militaire @fr
type: Class

website
label: site web @fr
label: Ιστότοπος @el
type: Class

model
label: mannequin @fr
type: Class

has Newspaper
domain: Formula One racer
type: ObjectProperty
range: newspaper
comment: Relazione tra Formula One Racer e Newspaper @it
comment: Relation between Formula One Racer and Newspaper

has Band
comment: Relation between Formula One Racer and Band
comment: Relazione tra Formula One Racer e Band @it
domain: Formula One racer
type: ObjectProperty
range: Band

has University
range: university
comment: Relazione tra Formula One Racer e University @it
domain: Formula One racer
comment: Relation between Formula One Racer and University
type: ObjectProperty

basketball player
label: joueur de basketball @fr
type: Class

has Broadcast
type: ObjectProperty
comment: Relazione tra Formula One Racer e Broadcast @it
range: broadcast
comment: Relation between Formula One Racer and Broadcast
domain: Formula One racer

has Language
comment: Relazione tra Formula One Racer e Language @it
comment: Relation between Formula One Racer and Language
type: ObjectProperty
domain: Formula One racer
range: language

has Continent
type: ObjectProperty
comment: Relazione tra Formula One Racer e Continent @it
comment: Relation between Formula One Racer and Continent
range: continent
domain: Formula One racer

ice hockey player
type: Class
label: joueur de hockey sur glace @fr

has Writer
range: writer
domain: Formula One racer
comment: Relation between Formula One Racer and Writer
type: ObjectProperty
comment: Relazione tra Formula One Racer e Writer @it

mountain range
label: chaîne de montagne @fr
type: Class

has Hotel
comment: Relazione tra Formula One Racer e Hotel @it
type: ObjectProperty
comment: Relation between Formula One Racer and Hotel
range: hotel
domain: Formula One racer

has Cricketer
comment: Relazione tra Formula One Racer e Cricketer @it
range: cricketer
type: ObjectProperty
domain: Formula One racer
comment: Relation between Formula One Racer and Cricketer

beverage
label: boisson @fr
type: Class

has British Royalty
related match: before
range: British royalty
domain: Formula One racer
comment: Relazione tra Formula One Racer e British Royalty @it
type: ObjectProperty
comment: Relation between Formula One Racer and British Royalty

comics creator
label: créateur de bandes dessinées @fr
type: Class

has Actor
type: ObjectProperty
comment: Relazione tra Formula One Racer e Actor @it
range: actor
comment: Relation between Formula One Racer and Actor
domain: Formula One racer

aircraft
label: αεροσκάφος @el
type: Class
label: avion @fr

has Single
comment: Relazione tra Formula One Racer e Single @it
domain: Formula One racer
comment: Relation between Formula One Racer and Single
type: ObjectProperty
range: single

soccer player
type: Class
label: joueur de football @fr

has Canal
type: ObjectProperty
domain: Formula One racer
comment: Relation between Formula One Racer and Canal
comment: Relazione tra Formula One Racer e Canal @it
range: canal

has Model
comment: Relazione tra Formula One Racer e Model @it
domain: Formula One racer
type: ObjectProperty
comment: Relation between Formula One Racer and Model
range: model

scientist
label: scientifique @fr
type: Class
label: Wissenschaftler @de

legislature
type: Class
label: pouvoir législatif @fr

has Aircraft
domain: Formula One racer
comment: Relation between Formula One Racer and Aircraft
type: ObjectProperty
comment: Relazione tra Formula One Racer e Aircraft @it
range: aircraft

has Award
type: ObjectProperty
comment: Relation between Formula One Racer and Award
comment: Relazione tra Formula One Racer e Award @it
range: award
domain: Formula One racer
related match: title

has Museum
comment: Relazione tra Formula One Racer e Museum @it
comment: Relation between Formula One Racer and Museum
range: museum
type: ObjectProperty
domain: Formula One racer

Axiom
annotated source: has Cyclist
annotated target: before
matching quantification: 1

airline
label: compagnie aérienne @fr
type: Class

olympics
label: Jeux Olympiques @fr
type: Class

monarch
label: monarque @fr
type: Class

has Beverage
domain: Formula One racer
type: ObjectProperty
comment: Relation between Formula One Racer and Beverage
range: beverage
comment: Relazione tra Formula One Racer e Beverage @it

has Comics Creator
domain: Formula One racer
comment: Relation between Formula One Racer and Comics Creator
range: comics creator
comment: Relazione tra Formula One Racer e Comics Creator @it
type: ObjectProperty

golf player
label: golfeur @fr
type: Class

has Playboy Playmate
comment: Relation between Formula One Racer and Playboy Playmate
type: ObjectProperty
range: Playboy Playmate
comment: Relazione tra Formula One Racer e Playboy Playmate @it
domain: Formula One racer

journalist
type: Class
label: journaliste @fr

has Soccer Manager
related match: before
range: soccer manager
comment: Relation between Formula One Racer and Soccer Manager
type: ObjectProperty
domain: Formula One racer
comment: Relazione tra Formula One Racer e Soccer Manager @it

plant
label: plante @fr
type: Class

broadcast
type: Class
label: Émission de télévision @fr

has Comedian
domain: Formula One racer
comment: Relazione tra Formula One Racer e Comedian @it
comment: Relation between Formula One Racer and Comedian
range: comedian
type: ObjectProperty

has Weapon
domain: Formula One racer
comment: Relation between Formula One Racer and Weapon
range: weapon
type: ObjectProperty
comment: Relazione tra Formula One Racer e Weapon @it

has Ethnic Group
type: ObjectProperty
domain: Formula One racer
comment: Relation between Formula One Racer and Ethnic Group
range: ethnic group
comment: Relazione tra Formula One Racer e Ethnic Group @it

film
type: Class
label: ταινία @el

has Video Game
comment: Relazione tra Formula One Racer e Video Game @it
range: video game
comment: Relation between Formula One Racer and Video Game
domain: Formula One racer
type: ObjectProperty

mammal
label: mammifère @fr
type: Class

has Book
range: book
type: ObjectProperty
comment: Relazione tra Formula One Racer e Book @it
comment: Relation between Formula One Racer and Book
domain: Formula One racer

island
label: île @fr
label: νησί @el
type: Class

Axiom
matching quantification: 2
annotated target: title
annotated source: has Award

has Bird
comment: Relazione tra Formula One Racer e Bird @it
domain: Formula One racer
comment: Relation between Formula One Racer and Bird
range: bird
type: ObjectProperty

comics character
type: Class
label: personnage de bandes dessinées @fr

bird
type: Class
label: oiseau @fr

chemical compound
label: produit chimique @fr
type: Class

has Mammal
comment: Relazione tra Formula One Racer e Mammal @it
domain: Formula One racer
type: ObjectProperty
comment: Relation between Formula One Racer and Mammal
range: mammal

Formula One racer
type: Class
label: pilote de formule 1 @fr

has Comics Character
type: ObjectProperty
domain: Formula One racer
range: comics character
comment: Relation between Formula One Racer and Comics Character
comment: Relazione tra Formula One Racer e Comics Character @it

radio station
label: station de radio @fr
type: Class

bone
label: os @fr
label: Knochen @de
type: Class

member of parliament
label: membre du Parlement @fr
type: Class

has Musical Artist
domain: Formula One racer
type: ObjectProperty
comment: Relation between Formula One Racer and Musical Artist
range: musical artist
comment: Relazione tra Formula One Racer e Musical Artist @it

musical artist
label: musicien @fr
type: Class
label: artista musical @pt

has Stadium
comment: Relation between Formula One Racer and Stadium
range: stadium
comment: Relazione tra Formula One Racer e Stadium @it
type: ObjectProperty
domain: Formula One racer

Axiom
annotated source: has Office Holder
matching quantification: 1
annotated target: successor

airport
type: Class
label: Flughafen @de
label: aéroport @fr