television show
type: Class
label: émission de télévision @fr

park
type: Class
label: parc @fr

disease
label: maladie @fr
type: Class

cardinal
type: Class

rugby player
label: joueur de rugby @fr
type: Class

Axiom
annotated source: has Prime Minister
annotated target: after
matching quantification: 2

american football league
type: Class

automobile
type: Class

has Writer
range: writer
comment: Relation between Gaelic Games Player and Writer
type: ObjectProperty
comment: Relazione tra Gaelic Games Player e Writer @it
domain: Gaelic games player
related match: before

has Continent
domain: Gaelic games player
comment: Relation between Gaelic Games Player and Continent
range: continent
comment: Relazione tra Gaelic Games Player e Continent @it
type: ObjectProperty

Election
label: élection @fr
type: Class

has Golf Player
comment: Relazione tra Gaelic Games Player e Golf Player @it
domain: Gaelic games player
range: golf player
type: ObjectProperty
comment: Relation between Gaelic Games Player and Golf Player
related match: after

actor
label: acteur @fr
type: Class
label: Schauspieler @de

american football player
label: joueur de football américain @fr
type: Class

Axiom
annotated source: has Rugby Player
matching quantification: 1
annotated target: before

stadium
type: Class
label: stade @fr

Axiom
matching quantification: 1
annotated source: has Golf Player
annotated target: after

soccer league
type: Class
label: ligue de football @fr

has American Football League
comment: Relation between Gaelic Games Player and American Football League
range: american football league
domain: Gaelic games player
comment: Relazione tra Gaelic Games Player e American Football League @it
type: ObjectProperty

has Soccer Player
related match: before
domain: Gaelic games player
range: soccer player
type: ObjectProperty
comment: Relation between Gaelic Games Player and Soccer Player
comment: Relazione tra Gaelic Games Player e Soccer Player @it

has Election
type: ObjectProperty
domain: Gaelic games player
comment: Relation between Gaelic Games Player and Election
range: Election
comment: Relazione tra Gaelic Games Player e Election @it

has Soccer Club
type: ObjectProperty
domain: Gaelic games player
comment: Relazione tra Gaelic Games Player e Soccer Club @it
range: soccer club
comment: Relation between Gaelic Games Player and Soccer Club

has Band
comment: Relazione tra Gaelic Games Player e Band @it
comment: Relation between Gaelic Games Player and Band
domain: Gaelic games player
range: Band
type: ObjectProperty

has Member Of Parliament
range: member of parliament
type: ObjectProperty
comment: Relazione tra Gaelic Games Player e Member Of Parliament @it
domain: Gaelic games player
comment: Relation between Gaelic Games Player and Member Of Parliament

has Radio Station
domain: Gaelic games player
comment: Relazione tra Gaelic Games Player e Radio Station @it
comment: Relation between Gaelic Games Player and Radio Station
range: radio station
type: ObjectProperty

pope
type: Class
label: pape @fr

comedian
type: Class
label: comédien @fr

has Soccer Manager
type: ObjectProperty
range: soccer manager
domain: Gaelic games player
comment: Relazione tra Gaelic Games Player e Soccer Manager @it
comment: Relation between Gaelic Games Player and Soccer Manager

Axiom
annotated source: has City
matching quantification: 1
annotated target: placeofbirth

newspaper
label: journal @fr
type: Class

has Mammal
comment: Relation between Gaelic Games Player and Mammal
domain: Gaelic games player
range: mammal
type: ObjectProperty
comment: Relazione tra Gaelic Games Player e Mammal @it

has Military Unit
range: military unit
type: ObjectProperty
domain: Gaelic games player
comment: Relazione tra Gaelic Games Player e Military Unit @it
comment: Relation between Gaelic Games Player and Military Unit

has Military Person
comment: Relation between Gaelic Games Player and Military Person
type: ObjectProperty
domain: Gaelic games player
comment: Relazione tra Gaelic Games Player e Military Person @it
range: military person

has Military Conflict
domain: Gaelic games player
comment: Relazione tra Gaelic Games Player e Military Conflict @it
range: military conflict
comment: Relation between Gaelic Games Player and Military Conflict
type: ObjectProperty

language
label: langage @fr
type: Class

has Cardinal
domain: Gaelic games player
comment: Relation between Gaelic Games Player and Cardinal
range: cardinal
comment: Relazione tra Gaelic Games Player e Cardinal @it
type: ObjectProperty

tennis league
label: ligue de tennis @fr
type: Class

has Soccer League
comment: Relation between Gaelic Games Player and Soccer League
type: ObjectProperty
range: soccer league
comment: Relazione tra Gaelic Games Player e Soccer League @it
domain: Gaelic games player

lake
label: lac @fr
type: Class

has Anatomical Structure
comment: Relazione tra Gaelic Games Player e Anatomical Structure @it
domain: Gaelic games player
range: anatomical structure
comment: Relation between Gaelic Games Player and Anatomical Structure
type: ObjectProperty

has Congressman
domain: Gaelic games player
type: ObjectProperty
comment: Relation between Gaelic Games Player and Congressman
range: congressman
comment: Relazione tra Gaelic Games Player e Congressman @it

has Office Holder
comment: Relation between Gaelic Games Player and Office Holder
domain: Gaelic games player
type: ObjectProperty
range: office holder
comment: Relazione tra Gaelic Games Player e Office Holder @it
related match: before
related match: after

governor
label: gouverneur @fr
type: Class

company
type: Class
label: entreprise @fr

Axiom
annotated target: before
annotated source: has President
matching quantification: 1

administrative region
type: Class
label: région administrative @fr

has Music Genre
comment: Relazione tra Gaelic Games Player e Music Genre @it
domain: Gaelic games player
comment: Relation between Gaelic Games Player and Music Genre
type: ObjectProperty
range: music genre

river
label: rivière @fr
type: Class

has Hospital
comment: Relazione tra Gaelic Games Player e Hospital @it
range: hospital
comment: Relation between Gaelic Games Player and Hospital
domain: Gaelic games player
type: ObjectProperty

school
label: école @fr
type: Class

ship
type: Class
label: navire @fr

has Rugby Player
range: rugby player
type: ObjectProperty
comment: Relation between Gaelic Games Player and Rugby Player
comment: Relazione tra Gaelic Games Player e Rugby Player @it
domain: Gaelic games player
related match: before

Ontology
has author: Aldo Gangemi
imports: cpannotationschema.owl
comment: GaelicGamesPlayer Encyclopedic Knowledge Pattern
has author: Valentina Presutti
has author: Andrea Giovanni Nuzzolese
extracted from: dbpedia.org
extracted from: en.wikipedia.org
has intent: To represent the encyclopedic knowledge expressed by an object typed as GaelicGamesPlayer

military person
type: Class
label: militaire @fr

Axiom
annotated source: has University
annotated target: colleges
matching quantification: 1

award
label: récompense @fr
type: Class

prime minister
type: Class
label: premier ministre @fr

has Comics Character
comment: Relazione tra Gaelic Games Player e Comics Character @it
type: ObjectProperty
range: comics character
comment: Relation between Gaelic Games Player and Comics Character
domain: Gaelic games player

hospital
label: hôpital @fr
type: Class

has River
domain: Gaelic games player
type: ObjectProperty
range: river
comment: Relation between Gaelic Games Player and River
comment: Relazione tra Gaelic Games Player e River @it

anatomical structure
type: Class
label: structure anatomique @fr

has Baseball Player
type: ObjectProperty
domain: Gaelic games player
comment: Relation between Gaelic Games Player and Baseball Player
range: baseball player
comment: Relazione tra Gaelic Games Player e Baseball Player @it

has Musical Artist
type: ObjectProperty
range: musical artist
domain: Gaelic games player
comment: Relazione tra Gaelic Games Player e Musical Artist @it
comment: Relation between Gaelic Games Player and Musical Artist

Band
label: banda @pt
label: Musikgruppe @de
type: Class
label: groupe de musique @fr

Axiom
matching quantification: 2
annotated target: after
annotated source: has Office Holder

town
label: ville @fr
type: Class

university
type: Class
label: université @fr
label: πανεπιστήμιο @el

has Airport
range: airport
domain: Gaelic games player
comment: Relation between Gaelic Games Player and Airport
comment: Relazione tra Gaelic Games Player e Airport @it
type: ObjectProperty

continent
type: Class
label: ήπειρος @el

Axiom
annotated source: has Prime Minister
matching quantification: 4
annotated target: before

president
type: Class
label: président @fr

has American Football Player
range: american football player
comment: Relation between Gaelic Games Player and American Football Player
type: ObjectProperty
comment: Relazione tra Gaelic Games Player e American Football Player @it
domain: Gaelic games player

military unit
type: Class
label: unité militaire @fr

Axiom
annotated source: has Soccer Player
matching quantification: 1
annotated target: before

has University
related match: colleges
range: university
comment: Relation between Gaelic Games Player and University
comment: Relazione tra Gaelic Games Player e University @it
domain: Gaelic games player
type: ObjectProperty

soccer manager
label: entraîneur de football @fr
type: Class

has Stadium
comment: Relazione tra Gaelic Games Player e Stadium @it
domain: Gaelic games player
range: stadium
type: ObjectProperty
comment: Relation between Gaelic Games Player and Stadium

village
label: χωριό @el
type: Class

has Ship
comment: Relazione tra Gaelic Games Player e Ship @it
domain: Gaelic games player
type: ObjectProperty
range: ship
comment: Relation between Gaelic Games Player and Ship

soccer club
type: Class
label: club de football @fr

music genre
type: Class
label: género musical @pt
label: genre musical @fr

has Tennis League
range: tennis league
comment: Relation between Gaelic Games Player and Tennis League
comment: Relazione tra Gaelic Games Player e Tennis League @it
domain: Gaelic games player
type: ObjectProperty

has Beverage
domain: Gaelic games player
comment: Relation between Gaelic Games Player and Beverage
range: beverage
type: ObjectProperty
comment: Relazione tra Gaelic Games Player e Beverage @it

writer
type: Class
label: écrivain @fr

has Broadcast
comment: Relazione tra Gaelic Games Player e Broadcast @it
type: ObjectProperty
domain: Gaelic games player
range: broadcast
comment: Relation between Gaelic Games Player and Broadcast

has Legislature
comment: Relation between Gaelic Games Player and Legislature
range: legislature
comment: Relazione tra Gaelic Games Player e Legislature @it
type: ObjectProperty
domain: Gaelic games player

baseball player
label: joueur de baseball @fr
type: Class

office holder
label: titulaire @fr
label: Amtsinhaber @de
type: Class

military conflict
type: Class
label: conflit militaire @fr

city
type: Class
label: cité @fr

has Lake
domain: Gaelic games player
range: lake
type: ObjectProperty
comment: Relation between Gaelic Games Player and Lake
comment: Relazione tra Gaelic Games Player e Lake @it

has Comedian
range: comedian
comment: Relation between Gaelic Games Player and Comedian
domain: Gaelic games player
comment: Relazione tra Gaelic Games Player e Comedian @it
type: ObjectProperty

has Company
type: ObjectProperty
range: company
comment: Relation between Gaelic Games Player and Company
comment: Relazione tra Gaelic Games Player e Company @it
domain: Gaelic games player

has Disease
type: ObjectProperty
domain: Gaelic games player
range: disease
comment: Relazione tra Gaelic Games Player e Disease @it
comment: Relation between Gaelic Games Player and Disease

has Park
comment: Relazione tra Gaelic Games Player e Park @it
type: ObjectProperty
range: park
comment: Relation between Gaelic Games Player and Park
domain: Gaelic games player

has Television Show
type: ObjectProperty
comment: Relation between Gaelic Games Player and Television Show
domain: Gaelic games player
comment: Relazione tra Gaelic Games Player e Television Show @it
range: television show

Christian Bishop
type: Class
label: évêque chrétien @fr

Axiom
annotated target: before
annotated source: has Actor
matching quantification: 1

beverage
type: Class
label: boisson @fr

Axiom
annotated target: before
annotated source: has Writer
matching quantification: 1

has School
comment: Relation between Gaelic Games Player and School
type: ObjectProperty
comment: Relazione tra Gaelic Games Player e School @it
domain: Gaelic games player
range: school

has Award
comment: Relation between Gaelic Games Player and Award
domain: Gaelic games player
comment: Relazione tra Gaelic Games Player e Award @it
type: ObjectProperty
range: award

has Pope
domain: Gaelic games player
range: pope
comment: Relation between Gaelic Games Player and Pope
type: ObjectProperty
comment: Relazione tra Gaelic Games Player e Pope @it

has Administrative Region
comment: Relation between Gaelic Games Player and Administrative Region
type: ObjectProperty
comment: Relazione tra Gaelic Games Player e Administrative Region @it
domain: Gaelic games player
range: administrative region

soccer player
type: Class
label: joueur de football @fr

has Newspaper
range: newspaper
type: ObjectProperty
domain: Gaelic games player
comment: Relation between Gaelic Games Player and Newspaper
comment: Relazione tra Gaelic Games Player e Newspaper @it

legislature
type: Class
label: pouvoir législatif @fr

has President
related match: before
type: ObjectProperty
comment: Relation between Gaelic Games Player and President
domain: Gaelic games player
range: president
comment: Relazione tra Gaelic Games Player e President @it

Axiom
annotated target: placeofbirth
matching quantification: 1
annotated source: has Village

has Town
range: town
comment: Relation between Gaelic Games Player and Town
comment: Relazione tra Gaelic Games Player e Town @it
domain: Gaelic games player
type: ObjectProperty

congressman
label: membre du Congrès @fr
type: Class

has City
type: ObjectProperty
comment: Relazione tra Gaelic Games Player e City @it
comment: Relation between Gaelic Games Player and City
range: city
domain: Gaelic games player
related match: placeofbirth

golf player
type: Class
label: golfeur @fr

has Film
comment: Relazione tra Gaelic Games Player e Film @it
range: film
domain: Gaelic games player
comment: Relation between Gaelic Games Player and Film
type: ObjectProperty

broadcast
label: Émission de télévision @fr
type: Class

has Actor
type: ObjectProperty
range: actor
domain: Gaelic games player
comment: Relation between Gaelic Games Player and Actor
comment: Relazione tra Gaelic Games Player e Actor @it
related match: before

has Automobile
type: ObjectProperty
domain: Gaelic games player
comment: Relazione tra Gaelic Games Player e Automobile @it
comment: Relation between Gaelic Games Player and Automobile
range: automobile

film
type: Class
label: ταινία @el

has Village
comment: Relation between Gaelic Games Player and Village
range: village
comment: Relazione tra Gaelic Games Player e Village @it
type: ObjectProperty
domain: Gaelic games player
related match: placeofbirth

mammal
label: mammifère @fr
type: Class

has Prime Minister
related match: before
related match: after
range: prime minister
type: ObjectProperty
comment: Relazione tra Gaelic Games Player e Prime Minister @it
domain: Gaelic games player
comment: Relation between Gaelic Games Player and Prime Minister

comics character
type: Class
label: personnage de bandes dessinées @fr

has Christian Bishop
comment: Relation between Gaelic Games Player and Christian Bishop
domain: Gaelic games player
range: Christian Bishop
type: ObjectProperty
comment: Relazione tra Gaelic Games Player e Christian Bishop @it

Gaelic games player
type: Class
label: joueur de sports gaéliques @fr

has Language
comment: Relation between Gaelic Games Player and Language
comment: Relazione tra Gaelic Games Player e Language @it
type: ObjectProperty
range: language
domain: Gaelic games player

radio station
type: Class
label: station de radio @fr

Axiom
annotated target: before
annotated source: has Office Holder
matching quantification: 3

member of parliament
label: membre du Parlement @fr
type: Class

has Governor
comment: Relation between Gaelic Games Player and Governor
domain: Gaelic games player
type: ObjectProperty
range: governor
comment: Relazione tra Gaelic Games Player e Governor @it

musical artist
label: musicien @fr
type: Class
label: artista musical @pt

airport
type: Class
label: Flughafen @de
label: aéroport @fr