television show
label: émission de télévision @fr
type: Class

rocket
label: fusée @fr
type: Class

disease
label: maladie @fr
type: Class

has Judge
comment: Relazione tra Historic Place e Judge @it
type: ObjectProperty
range: judge
comment: Relation between Historic Place and Judge
domain: historic place

has Monarch
domain: historic place
comment: Relation between Historic Place and Monarch
type: ObjectProperty
range: monarch
comment: Relazione tra Historic Place e Monarch @it

automobile
type: Class

colour
label: χρώμα @el
label: couleur @fr
type: Class

has Vein
type: ObjectProperty
range: vein
comment: Relation between Historic Place and Vein
comment: Relazione tra Historic Place e Vein @it
domain: historic place

Election
label: élection @fr
type: Class

has Reptile
domain: historic place
type: ObjectProperty
range: reptile
comment: Relation between Historic Place and Reptile
comment: Relazione tra Historic Place e Reptile @it

has Baseball Player
comment: Relazione tra Historic Place e Baseball Player @it
type: ObjectProperty
comment: Relation between Historic Place and Baseball Player
domain: historic place
range: baseball player

has Writer
range: writer
type: ObjectProperty
comment: Relation between Historic Place and Writer
comment: Relazione tra Historic Place e Writer @it
domain: historic place

american football player
label: joueur de football américain @fr
type: Class

has Non- Profit Organisation
domain: historic place
comment: Relazione tra Historic Place e Non- Profit Organisation @it
range: non-profit organisation
comment: Relation between Historic Place and Non- Profit Organisation
type: ObjectProperty

stadium
label: stade @fr
type: Class

has Moss
comment: Relation between Historic Place and Moss
type: ObjectProperty
comment: Relazione tra Historic Place e Moss @it
domain: historic place
range: moss

astronaut
type: Class
label: Astronaut @de
label: astronaute @fr

has Soccer Club
type: ObjectProperty
comment: Relation between Historic Place and Soccer Club
comment: Relazione tra Historic Place e Soccer Club @it
range: soccer club
domain: historic place

has Radio Station
comment: Relation between Historic Place and Radio Station
domain: historic place
range: radio station
comment: Relazione tra Historic Place e Radio Station @it
type: ObjectProperty

has Sport
domain: historic place
type: ObjectProperty
comment: Relazione tra Historic Place e Sport @it
comment: Relation between Historic Place and Sport
range: sport

wrestler
label: lutteur @fr
type: Class

has Military Person
related match: architect
range: military person
comment: Relation between Historic Place and Military Person
type: ObjectProperty
comment: Relazione tra Historic Place e Military Person @it
domain: historic place

has Weapon
comment: Relazione tra Historic Place e Weapon @it
type: ObjectProperty
range: weapon
domain: historic place
comment: Relation between Historic Place and Weapon

mayor
type: Class
label: maire @fr

has Book
type: ObjectProperty
range: book
comment: Relation between Historic Place and Book
domain: historic place
comment: Relazione tra Historic Place e Book @it

amphibian
type: Class
label: amphibien @fr

pope
type: Class
label: pape @fr

has Bird
range: bird
domain: historic place
type: ObjectProperty
comment: Relation between Historic Place and Bird
comment: Relazione tra Historic Place e Bird @it

has Shopping Mall
comment: Relazione tra Historic Place e Shopping Mall @it
type: ObjectProperty
range: shopping mall
domain: historic place
comment: Relation between Historic Place and Shopping Mall

newspaper
label: journal @fr
type: Class

protected area
label: aire protégée @fr
label: προστατευμένη περιοχή @el
type: Class

game
label: jeu @fr
type: Class

road
label: route @fr
type: Class

ginkgo
type: Class

boxer
type: Class
label: boxeur @fr

judge
label: juge @fr
type: Class

Axiom
matching quantification: 10
annotated target: before
annotated source: has Skyscraper

World Heritage Site
type: Class
label: site du patrimoine mondial @fr

Axiom
matching quantification: 4
annotated source: has University
annotated target: location

has Space Mission
type: ObjectProperty
domain: historic place
range: space mission
comment: Relation between Historic Place and Space Mission
comment: Relazione tra Historic Place e Space Mission @it

has Grand Prix
comment: Relazione tra Historic Place e Grand Prix @it
domain: historic place
range: Grand Prix
type: ObjectProperty
comment: Relation between Historic Place and Grand Prix
related match: events

language
label: langage @fr
type: Class

station
type: Class

tennis league
type: Class
label: ligue de tennis @fr

has Lake
type: ObjectProperty
range: lake
comment: Relazione tra Historic Place e Lake @it
domain: historic place
comment: Relation between Historic Place and Lake

has Mayor
range: mayor
type: ObjectProperty
comment: Relazione tra Historic Place e Mayor @it
comment: Relation between Historic Place and Mayor
domain: historic place

Axiom
annotated source: has Military Person
matching quantification: 1
annotated target: architect

lake
label: lac @fr
type: Class

has Adult Actor
comment: Relazione tra Historic Place e Adult Actor @it
comment: Relation between Historic Place and Adult Actor
type: ObjectProperty
domain: historic place
range: adult actor

has Club Moss
range: club moss
comment: Relazione tra Historic Place e Club Moss @it
type: ObjectProperty
comment: Relation between Historic Place and Club Moss
domain: historic place

has Figure Skater
range: figure skater
comment: Relation between Historic Place and Figure Skater
type: ObjectProperty
domain: historic place
comment: Relazione tra Historic Place e Figure Skater @it

has Website
comment: Relation between Historic Place and Website
type: ObjectProperty
comment: Relazione tra Historic Place e Website @it
domain: historic place
range: website

arachnid
label: arachnides @fr
type: Class

has Member Of Parliament
comment: Relazione tra Historic Place e Member Of Parliament @it
range: member of parliament
comment: Relation between Historic Place and Member Of Parliament
domain: historic place
type: ObjectProperty

has Television Show
range: television show
comment: Relazione tra Historic Place e Television Show @it
domain: historic place
comment: Relation between Historic Place and Television Show
type: ObjectProperty

has American Football League
domain: historic place
range: american football league
type: ObjectProperty
comment: Relation between Historic Place and American Football League
comment: Relazione tra Historic Place e American Football League @it

governor
label: gouverneur @fr
type: Class

has College
comment: Relation between Historic Place and College
type: ObjectProperty
domain: historic place
range: college
comment: Relazione tra Historic Place e College @it

has Wrestler
comment: Relation between Historic Place and Wrestler
comment: Relazione tra Historic Place e Wrestler @it
type: ObjectProperty
range: wrestler
domain: historic place

poker player
type: Class
label: joueur de poker @fr

Axiom
annotated source: has Ethnic Group
annotated target: nativetribe
matching quantification: 7

river
label: rivière @fr
type: Class

Axiom
annotated target: location
annotated source: has Road
matching quantification: 5

has Ship
type: ObjectProperty
domain: historic place
comment: Relation between Historic Place and Ship
comment: Relazione tra Historic Place e Ship @it
range: ship

school
type: Class
label: école @fr

museum
type: Class
label: musée @fr

ship
label: navire @fr
type: Class

fish
type: Class
label: poisson @fr

tennis player
label: joueur de tennis @fr
type: Class

video game
type: Class
label: jeux vidéo @fr

has Restaurant
type: ObjectProperty
range: restaurant
comment: Relation between Historic Place and Restaurant
comment: Relazione tra Historic Place e Restaurant @it
domain: historic place

trade union
type: Class
label: syndicat professionnel @fr

Axiom
annotated target: after
matching quantification: 23
annotated source: has Skyscraper

currency
type: Class
label: devise @fr

has Governor
comment: Relazione tra Historic Place e Governor @it
type: ObjectProperty
domain: historic place
comment: Relation between Historic Place and Governor
range: governor

has Cave
range: cave
domain: historic place
comment: Relation between Historic Place and Cave
comment: Relazione tra Historic Place e Cave @it
type: ObjectProperty

British royalty
type: Class
label: royauté Britannique @fr

prime minister
label: premier ministre @fr
type: Class

has Fish
domain: historic place
range: fish
comment: Relation between Historic Place and Fish
comment: Relazione tra Historic Place e Fish @it
type: ObjectProperty

historic place
type: Class
label: site historique @fr

has Insect
range: insect
comment: Relazione tra Historic Place e Insect @it
domain: historic place
type: ObjectProperty
comment: Relation between Historic Place and Insect

hospital
type: Class
label: hôpital @fr

has Bacteria
domain: historic place
comment: Relazione tra Historic Place e Bacteria @it
range: bacteria
type: ObjectProperty
comment: Relation between Historic Place and Bacteria

monument
type: Class

has Song
domain: historic place
type: ObjectProperty
comment: Relation between Historic Place and Song
range: song
comment: Relazione tra Historic Place e Song @it

lunar crater
type: Class
label: cratère lunaire @fr

has Wine Region
type: ObjectProperty
domain: historic place
range: wine region
comment: Relation between Historic Place and Wine Region
comment: Relazione tra Historic Place e Wine Region @it

has Bone
range: bone
comment: Relazione tra Historic Place e Bone @it
comment: Relation between Historic Place and Bone
type: ObjectProperty
domain: historic place

Axiom
annotated target: architect
matching quantification: 1
annotated source: has President

Axiom
matching quantification: 1
annotated target: endPoints
annotated source: has Park

continent
type: Class
label: ήπειρος @el

has Airport
comment: Relation between Historic Place and Airport
type: ObjectProperty
range: airport
comment: Relazione tra Historic Place e Airport @it
domain: historic place

has Mountain Range
range: mountain range
domain: historic place
type: ObjectProperty
comment: Relation between Historic Place and Mountain Range
comment: Relazione tra Historic Place e Mountain Range @it

album
type: Class
label: Album @de

president
label: président @fr
type: Class

has Boxer
domain: historic place
comment: Relation between Historic Place and Boxer
range: boxer
type: ObjectProperty
comment: Relazione tra Historic Place e Boxer @it

has Arachnid
type: ObjectProperty
comment: Relation between Historic Place and Arachnid
comment: Relazione tra Historic Place e Arachnid @it
domain: historic place
range: arachnid

figure skater
type: Class
label: patineur artistique @fr

has Prime Minister
type: ObjectProperty
comment: Relazione tra Historic Place e Prime Minister @it
comment: Relation between Historic Place and Prime Minister
domain: historic place
range: prime minister

has Military Conflict
range: military conflict
comment: Relation between Historic Place and Military Conflict
type: ObjectProperty
comment: Relazione tra Historic Place e Military Conflict @it
domain: historic place

moss
label: mousses @fr
type: Class

Axiom
annotated source: has Historic Building
annotated target: after
matching quantification: 1

has Language
related match: nativetribe
comment: Relation between Historic Place and Language
comment: Relazione tra Historic Place e Language @it
domain: historic place
range: language
type: ObjectProperty

Axiom
annotated source: has Protected Area
annotated target: location
matching quantification: 1

military unit
label: unité militaire @fr
type: Class

has Canadian Football League
type: ObjectProperty
domain: historic place
range: canadian football league
comment: Relation between Historic Place and Canadian Football League
comment: Relazione tra Historic Place e Canadian Football League @it

has Pope
range: pope
type: ObjectProperty
domain: historic place
comment: Relation between Historic Place and Pope
comment: Relazione tra Historic Place e Pope @it

has Broadcast
comment: Relazione tra Historic Place e Broadcast @it
type: ObjectProperty
domain: historic place
range: broadcast
comment: Relation between Historic Place and Broadcast

has Park
related match: endPoints
comment: Relation between Historic Place and Park
domain: historic place
comment: Relazione tra Historic Place e Park @it
type: ObjectProperty
range: park

basketball team
type: Class

has Cricketer
type: ObjectProperty
comment: Relazione tra Historic Place e Cricketer @it
comment: Relation between Historic Place and Cricketer
domain: historic place
range: cricketer

has Planet
type: ObjectProperty
domain: historic place
comment: Relazione tra Historic Place e Planet @it
comment: Relation between Historic Place and Planet
range: planet

has Island
domain: historic place
comment: Relazione tra Historic Place e Island @it
range: island
comment: Relation between Historic Place and Island
type: ObjectProperty

canadian football team
label: équipe canadienne de football américain @fr
type: Class

music genre
type: Class
label: género musical @pt
label: genre musical @fr

has Poker Player
range: poker player
comment: Relation between Historic Place and Poker Player
type: ObjectProperty
comment: Relazione tra Historic Place e Poker Player @it
domain: historic place

cycad
type: Class
label: cycadophytes @fr

has Wrestling Event
range: wrestling event
comment: Relazione tra Historic Place e Wrestling Event @it
comment: Relation between Historic Place and Wrestling Event
domain: historic place
type: ObjectProperty

writer
type: Class
label: écrivain @fr

record label
type: Class
label: label discographique @fr

architect
label: architecte @fr
type: Class

model
type: Class
label: mannequin @fr

has Game
comment: Relation between Historic Place and Game
type: ObjectProperty
range: game
domain: historic place
comment: Relazione tra Historic Place e Game @it

has Fungus
type: ObjectProperty
comment: Relazione tra Historic Place e Fungus @it
range: fungus
domain: historic place
comment: Relation between Historic Place and Fungus

has Basketball League
range: basketball league
type: ObjectProperty
comment: Relation between Historic Place and Basketball League
domain: historic place
comment: Relazione tra Historic Place e Basketball League @it

has Chemical Compound
domain: historic place
type: ObjectProperty
comment: Relation between Historic Place and Chemical Compound
range: chemical compound
comment: Relazione tra Historic Place e Chemical Compound @it

ambassador
label: ambassadeur @fr
type: Class

has Ethnic Group
domain: historic place
comment: Relazione tra Historic Place e Ethnic Group @it
comment: Relation between Historic Place and Ethnic Group
type: ObjectProperty
range: ethnic group
related match: combatant
related match: nativetribe

has Fern
range: fern
domain: historic place
type: ObjectProperty
comment: Relazione tra Historic Place e Fern @it
comment: Relation between Historic Place and Fern

crustacean
label: crustacés @fr
type: Class

has Drug
comment: Relation between Historic Place and Drug
range: drug
type: ObjectProperty
comment: Relazione tra Historic Place e Drug @it
domain: historic place

has Ice Hockey League
domain: historic place
range: ice hockey league
type: ObjectProperty
comment: Relation between Historic Place and Ice Hockey League
comment: Relazione tra Historic Place e Ice Hockey League @it

Axiom
annotated source: has Saint
annotated target: namesake
matching quantification: 2

has Single
comment: Relation between Historic Place and Single
domain: historic place
type: ObjectProperty
range: single
comment: Relazione tra Historic Place e Single @it

film festival
type: Class
label: festival du film @fr

has Architect
related match: architect
comment: Relazione tra Historic Place e Architect @it
comment: Relation between Historic Place and Architect
domain: historic place
range: architect
type: ObjectProperty

has College Coach
comment: Relation between Historic Place and College Coach
range: college coach
domain: historic place
type: ObjectProperty
comment: Relazione tra Historic Place e College Coach @it

Grand Prix
type: Class
label: grand prix @fr

Axiom
annotated target: title
annotated source: has Tennis League
matching quantification: 2

has World Heritage Site
comment: Relation between Historic Place and World Heritage Site
range: World Heritage Site
domain: historic place
comment: Relazione tra Historic Place e World Heritage Site @it
type: ObjectProperty

has Congressman
comment: Relazione tra Historic Place e Congressman @it
domain: historic place
range: congressman
comment: Relation between Historic Place and Congressman
type: ObjectProperty

lighthouse
label: phare @fr
type: Class

has President
range: president
type: ObjectProperty
comment: Relation between Historic Place and President
comment: Relazione tra Historic Place e President @it
domain: historic place
related match: architect

chancellor
label: chancelier @fr
type: Class

comics creator
label: créateur de bandes dessinées @fr
type: Class

has Canadian Football Team
comment: Relazione tra Historic Place e Canadian Football Team @it
type: ObjectProperty
comment: Relation between Historic Place and Canadian Football Team
range: canadian football team
domain: historic place

aircraft
label: αεροσκάφος @el
type: Class
label: avion @fr

has Tennis Player
comment: Relation between Historic Place and Tennis Player
range: tennis player
comment: Relazione tra Historic Place e Tennis Player @it
type: ObjectProperty
domain: historic place

has Chancellor
type: ObjectProperty
comment: Relation between Historic Place and Chancellor
domain: historic place
range: chancellor
comment: Relazione tra Historic Place e Chancellor @it

has Convention
comment: Relazione tra Historic Place e Convention @it
type: ObjectProperty
range: convention
domain: historic place
comment: Relation between Historic Place and Convention

hockey team
type: Class
label: équipe de hockey @fr

has Award
comment: Relation between Historic Place and Award
type: ObjectProperty
comment: Relazione tra Historic Place e Award @it
range: award
domain: historic place
related match: title

soccer player
type: Class
label: joueur de football @fr

club moss
label: lycopodiopsida @fr
type: Class

has Formula One Racer
type: ObjectProperty
range: Formula One racer
domain: historic place
comment: Relazione tra Historic Place e Formula One Racer @it
comment: Relation between Historic Place and Formula One Racer

reptile
type: Class

legislature
type: Class
label: pouvoir législatif @fr

has Video Game
type: ObjectProperty
comment: Relation between Historic Place and Video Game
comment: Relazione tra Historic Place e Video Game @it
domain: historic place
range: video game

cave
type: Class
label: grotte @fr

has Rocket
domain: historic place
range: rocket
comment: Relazione tra Historic Place e Rocket @it
comment: Relation between Historic Place and Rocket
type: ObjectProperty

has Road
range: road
type: ObjectProperty
comment: Relation between Historic Place and Road
comment: Relazione tra Historic Place e Road @it
domain: historic place
related match: location

airline
label: compagnie aérienne @fr
type: Class

has Cyclist
type: ObjectProperty
comment: Relation between Historic Place and Cyclist
range: cyclist
comment: Relazione tra Historic Place e Cyclist @it
domain: historic place

monarch
type: Class
label: monarque @fr

Axiom
annotated source: has Stadium
matching quantification: 1
annotated target: after

congressman
label: membre du Congrès @fr
type: Class

golf player
label: golfeur @fr
type: Class

nascar driver
type: Class
label: pilote de la nascar @fr

has Journalist
comment: Relazione tra Historic Place e Journalist @it
range: journalist
type: ObjectProperty
comment: Relation between Historic Place and Journalist
domain: historic place

journalist
label: journaliste @fr
type: Class

space mission
label: mission spatiale @fr
label: διαστημική αποστολή @el
type: Class

insect
type: Class
label: insecte @fr

film
label: ταινία @el
type: Class

american football team
label: équipe américaine de football américain @fr
type: Class

has Mountain
comment: Relazione tra Historic Place e Mountain @it
comment: Relation between Historic Place and Mountain
type: ObjectProperty
domain: historic place
range: mountain

Supreme Court of the United States case
type: Class
label: cas juridique de la Cour suprême des États-Unis @fr

Axiom
annotated source: has Ethnic Group
matching quantification: 2
annotated target: combatant

chemical compound
label: produit chimique @fr
type: Class

bird
label: oiseau @fr
type: Class

has Space Shuttle
type: ObjectProperty
range: space shuttle
comment: Relazione tra Historic Place e Space Shuttle @it
domain: historic place
comment: Relation between Historic Place and Space Shuttle

has Mammal
range: mammal
type: ObjectProperty
comment: Relazione tra Historic Place e Mammal @it
domain: historic place
comment: Relation between Historic Place and Mammal

fungus
type: Class
label: fungi @fr

fern
type: Class
label: fougères @fr

musical artist
label: artista musical @pt
type: Class
label: musicien @fr

Axiom
matching quantification: 3
annotated target: occupants
annotated source: has Military Unit

has Space Station
comment: Relation between Historic Place and Space Station
comment: Relazione tra Historic Place e Space Station @it
type: ObjectProperty
range: space station
domain: historic place

has National Collegiate Athletic Association Athlete
domain: historic place
comment: Relazione tra Historic Place e National Collegiate Athletic Association Athlete @it
comment: Relation between Historic Place and National Collegiate Athletic Association Athlete
type: ObjectProperty
range: national collegiate athletic association athlete

has Saint
range: saint
comment: Relation between Historic Place and Saint
type: ObjectProperty
comment: Relazione tra Historic Place e Saint @it
domain: historic place
related match: namesake

has Lighthouse
comment: Relazione tra Historic Place e Lighthouse @it
domain: historic place
range: lighthouse
type: ObjectProperty
comment: Relation between Historic Place and Lighthouse

Axiom
annotated source: has Grand Prix
matching quantification: 1
annotated target: events

has Playboy Playmate
comment: Relation between Historic Place and Playboy Playmate
range: Playboy Playmate
comment: Relazione tra Historic Place e Playboy Playmate @it
domain: historic place
type: ObjectProperty

park
label: parc @fr
type: Class

has Protected Area
domain: historic place
comment: Relation between Historic Place and Protected Area
type: ObjectProperty
range: protected area
comment: Relazione tra Historic Place e Protected Area @it
related match: location

has Grape
comment: Relazione tra Historic Place e Grape @it
domain: historic place
comment: Relation between Historic Place and Grape
type: ObjectProperty
range: grape

cardinal
type: Class

has Conifer
comment: Relazione tra Historic Place e Conifer @it
type: ObjectProperty
comment: Relation between Historic Place and Conifer
domain: historic place
range: conifer

american football league
type: Class

has Military Unit
related match: occupants
comment: Relazione tra Historic Place e Military Unit @it
domain: historic place
range: military unit
comment: Relation between Historic Place and Military Unit
type: ObjectProperty

has Automobile
range: automobile
comment: Relazione tra Historic Place e Automobile @it
comment: Relation between Historic Place and Automobile
domain: historic place
type: ObjectProperty

musical
type: Class
label: musique @fr

has Magazine
range: magazine
comment: Relation between Historic Place and Magazine
type: ObjectProperty
comment: Relazione tra Historic Place e Magazine @it
domain: historic place

has American Football Team
comment: Relazione tra Historic Place e American Football Team @it
comment: Relation between Historic Place and American Football Team
range: american football team
domain: historic place
type: ObjectProperty

cyclist
type: Class
label: cycliste @fr

has Amphibian
domain: historic place
comment: Relazione tra Historic Place e Amphibian @it
range: amphibian
type: ObjectProperty
comment: Relation between Historic Place and Amphibian

has Monument
comment: Relazione tra Historic Place e Monument @it
comment: Relation between Historic Place and Monument
type: ObjectProperty
range: monument
domain: historic place

has British Royalty
comment: Relazione tra Historic Place e British Royalty @it
domain: historic place
range: British royalty
type: ObjectProperty
comment: Relation between Historic Place and British Royalty

national collegiate athletic association athlete
label: athlète de la national collegiate athletic association @fr
type: Class

has Soccer Player
comment: Relazione tra Historic Place e Soccer Player @it
range: soccer player
type: ObjectProperty
comment: Relation between Historic Place and Soccer Player
domain: historic place

has Comedian
comment: Relazione tra Historic Place e Comedian @it
type: ObjectProperty
comment: Relation between Historic Place and Comedian
range: comedian
domain: historic place

has Film
comment: Relazione tra Historic Place e Film @it
comment: Relation between Historic Place and Film
domain: historic place
range: film
type: ObjectProperty

Axiom
matching quantification: 2
annotated target: location
annotated source: has River

wrestling event
label: match de catch @fr
type: Class

basketball league
label: ligue de basketball @fr
type: Class

mountain
label: Βουνό @el
label: montagne @fr
type: Class

criminal
type: Class
label: criminel @fr

space shuttle
type: Class
label: navette spatiale @fr

has Astronaut
comment: Relation between Historic Place and Astronaut
comment: Relazione tra Historic Place e Astronaut @it
type: ObjectProperty
domain: historic place
range: astronaut

senator
label: sénateur @fr
type: Class

saint
type: Class

valley
type: Class
label: vallée @fr

comedian
label: comédien @fr
type: Class

has Colour
comment: Relation between Historic Place and Colour
type: ObjectProperty
range: colour
comment: Relazione tra Historic Place e Colour @it
domain: historic place

song
label: chanson @fr
type: Class

has Basketball Player
domain: historic place
type: ObjectProperty
comment: Relation between Historic Place and Basketball Player
range: basketball player
comment: Relazione tra Historic Place e Basketball Player @it

has Criminal
comment: Relation between Historic Place and Criminal
comment: Relazione tra Historic Place e Criminal @it
type: ObjectProperty
domain: historic place
range: criminal

Playboy Playmate
type: Class
label: playmate pour Playboy @fr

convention
label: congrès @fr
type: Class

book
type: Class
label: livre @fr
label: βιβλίο @el
label: llibre @ca
label: książka @pl

has Beverage
comment: Relation between Historic Place and Beverage
range: beverage
type: ObjectProperty
comment: Relazione tra Historic Place e Beverage @it
domain: historic place

has Lunar Crater
type: ObjectProperty
comment: Relation between Historic Place and Lunar Crater
domain: historic place
range: lunar crater
comment: Relazione tra Historic Place e Lunar Crater @it

has Record Label
comment: Relazione tra Historic Place e Record Label @it
range: record label
domain: historic place
comment: Relation between Historic Place and Record Label
type: ObjectProperty

shopping mall
label: centre commercial @fr
type: Class

has Ambassador
domain: historic place
comment: Relation between Historic Place and Ambassador
type: ObjectProperty
comment: Relazione tra Historic Place e Ambassador @it
range: ambassador

has Supreme Court Of The United States Case
comment: Relazione tra Historic Place e Supreme Court Of The United States Case @it
range: Supreme Court of the United States case
domain: historic place
comment: Relation between Historic Place and Supreme Court Of The United States Case
type: ObjectProperty

has Philosopher
domain: historic place
range: philosopher
type: ObjectProperty
comment: Relation between Historic Place and Philosopher
comment: Relazione tra Historic Place e Philosopher @it

bacteria
label: bactérie @fr
type: Class

has Disease
range: disease
type: ObjectProperty
comment: Relation between Historic Place and Disease
domain: historic place
comment: Relazione tra Historic Place e Disease @it

ski area
label: domaine skiable @fr
type: Class

space station
type: Class
label: station spatiale @fr

non-profit organisation
type: Class
label: organisation à but non lucratif @fr

has University
domain: historic place
range: university
comment: Relation between Historic Place and University
comment: Relazione tra Historic Place e University @it
type: ObjectProperty
related match: museum
related match: location
related match: data

Ontology
has author: Aldo Gangemi
has author: Valentina Presutti
has author: Andrea Giovanni Nuzzolese
has intent: To represent the encyclopedic knowledge expressed by an object typed as HistoricPlace
comment: HistoricPlace Encyclopedic Knowledge Pattern
extracted from: dbpedia.org
imports: cpannotationschema.owl
extracted from: en.wikipedia.org

canadian football league
type: Class

has Scientist
comment: Relazione tra Historic Place e Scientist @it
type: ObjectProperty
range: scientist
domain: historic place
comment: Relation between Historic Place and Scientist

mollusca
type: Class
label: mollusque @fr

wine region
label: région viticole @fr
type: Class

has Mollusca
comment: Relazione tra Historic Place e Mollusca @it
type: ObjectProperty
domain: historic place
comment: Relation between Historic Place and Mollusca
range: mollusca

weapon
type: Class
label: arme @fr

drug
type: Class
label: médicament @fr

has Newspaper
comment: Relazione tra Historic Place e Newspaper @it
range: newspaper
domain: historic place
type: ObjectProperty
comment: Relation between Historic Place and Newspaper

has Baseball League
comment: Relazione tra Historic Place e Baseball League @it
comment: Relation between Historic Place and Baseball League
range: baseball league
domain: historic place
type: ObjectProperty

magazine
label: περιοδικό @el
type: Class

has Christian Bishop
comment: Relation between Historic Place and Christian Bishop
comment: Relazione tra Historic Place e Christian Bishop @it
type: ObjectProperty
range: Christian Bishop
domain: historic place

has Music Festival
comment: Relation between Historic Place and Music Festival
range: music festival
type: ObjectProperty
comment: Relazione tra Historic Place e Music Festival @it
domain: historic place

has Basketball Team
type: ObjectProperty
comment: Relazione tra Historic Place e Basketball Team @it
range: basketball team
domain: historic place
comment: Relation between Historic Place and Basketball Team

has Comics Character
type: ObjectProperty
range: comics character
comment: Relation between Historic Place and Comics Character
domain: historic place
comment: Relazione tra Historic Place e Comics Character @it

canal
type: Class

has Olympics
domain: historic place
comment: Relation between Historic Place and Olympics
range: olympics
type: ObjectProperty
comment: Relazione tra Historic Place e Olympics @it

military person
label: militaire @fr
type: Class

philosopher
label: philosophe @fr
type: Class

has River
range: river
domain: historic place
type: ObjectProperty
comment: Relazione tra Historic Place e River @it
comment: Relation between Historic Place and River
related match: location

award
label: récompense @fr
type: Class

locomotive
type: Class

has Continent
type: ObjectProperty
range: continent
domain: historic place
comment: Relation between Historic Place and Continent
comment: Relazione tra Historic Place e Continent @it

college
type: Class

sport
type: Class

restaurant
type: Class

cricketer
label: joueur de cricket @fr
type: Class

single
type: Class

has Office Holder
comment: Relazione tra Historic Place e Office Holder @it
type: ObjectProperty
comment: Relation between Historic Place and Office Holder
range: office holder
domain: historic place

Band
label: banda @pt
label: Musikgruppe @de
type: Class
label: groupe de musique @fr

has Cardinal
type: ObjectProperty
range: cardinal
comment: Relation between Historic Place and Cardinal
domain: historic place
comment: Relazione tra Historic Place e Cardinal @it

has Golf Player
comment: Relazione tra Historic Place e Golf Player @it
range: golf player
type: ObjectProperty
domain: historic place
comment: Relation between Historic Place and Golf Player

university
label: πανεπιστήμιο @el
label: université @fr
type: Class

ethnic group
label: groupe ethnique @fr
type: Class

has Film Festival
domain: historic place
type: ObjectProperty
comment: Relazione tra Historic Place e Film Festival @it
comment: Relation between Historic Place and Film Festival
range: film festival

has Bridge
range: bridge
comment: Relation between Historic Place and Bridge
type: ObjectProperty
domain: historic place
comment: Relazione tra Historic Place e Bridge @it

has Hospital
comment: Relazione tra Historic Place e Hospital @it
range: hospital
type: ObjectProperty
domain: historic place
comment: Relation between Historic Place and Hospital

has Hotel
domain: historic place
comment: Relazione tra Historic Place e Hotel @it
type: ObjectProperty
comment: Relation between Historic Place and Hotel
range: hotel

has Musical
comment: Relazione tra Historic Place e Musical @it
range: musical
comment: Relation between Historic Place and Musical
domain: historic place
type: ObjectProperty

hotel
type: Class
label: hôtel @fr

music festival
label: festival de musique @fr
type: Class

Axiom
annotated target: data
annotated source: has University
matching quantification: 1

has Skyscraper
related match: after
related match: before
comment: Relazione tra Historic Place e Skyscraper @it
range: skyscraper
domain: historic place
comment: Relation between Historic Place and Skyscraper
type: ObjectProperty

college coach
type: Class
label: entraîneur universitaire @fr

has Ice Hockey Player
domain: historic place
comment: Relazione tra Historic Place e Ice Hockey Player @it
comment: Relation between Historic Place and Ice Hockey Player
type: ObjectProperty
range: ice hockey player

television episode
type: Class
label: épisode télévisé @fr

has Golf League
range: golf league
type: ObjectProperty
domain: historic place
comment: Relazione tra Historic Place e Golf League @it
comment: Relation between Historic Place and Golf League

village
label: χωριό @el
type: Class

has Valley
comment: Relation between Historic Place and Valley
comment: Relazione tra Historic Place e Valley @it
range: valley
domain: historic place
type: ObjectProperty

ice hockey league
type: Class
label: ligue d'hockey sur glace @fr

Axiom
annotated target: location
matching quantification: 1
annotated source: has School

soccer club
label: club de football @fr
type: Class

has Village
range: village
domain: historic place
comment: Relazione tra Historic Place e Village @it
comment: Relation between Historic Place and Village
type: ObjectProperty

has Airline
type: ObjectProperty
range: airline
domain: historic place
comment: Relazione tra Historic Place e Airline @it
comment: Relation between Historic Place and Airline

has Station
type: ObjectProperty
comment: Relation between Historic Place and Station
domain: historic place
comment: Relazione tra Historic Place e Station @it
range: station

has School
type: ObjectProperty
range: school
comment: Relazione tra Historic Place e School @it
comment: Relation between Historic Place and School
domain: historic place
related match: location

historic building
label: bâtiment historique @fr
type: Class

has Legislature
domain: historic place
comment: Relation between Historic Place and Legislature
range: legislature
comment: Relazione tra Historic Place e Legislature @it
type: ObjectProperty

has Currency
range: currency
comment: Relazione tra Historic Place e Currency @it
domain: historic place
type: ObjectProperty
comment: Relation between Historic Place and Currency

office holder
label: titulaire @fr
label: Amtsinhaber @de
type: Class

baseball player
label: joueur de baseball @fr
type: Class

military conflict
label: conflit militaire @fr
type: Class

grape
label: raisin @fr
type: Class

website
type: Class
label: site web @fr
label: Ιστότοπος @el

basketball player
type: Class
label: joueur de basketball @fr

launch pad
type: Class
label: rampe de lancement @fr

adult actor
label: acteur adulte @fr
type: Class
label: erwachsener Schauspieler @de

Axiom
matching quantification: 1
annotated target: title
annotated source: has Award

has Model
domain: historic place
range: model
comment: Relazione tra Historic Place e Model @it
comment: Relation between Historic Place and Model
type: ObjectProperty

has Museum
type: ObjectProperty
comment: Relation between Historic Place and Museum
comment: Relazione tra Historic Place e Museum @it
domain: historic place
range: museum

ice hockey player
label: joueur de hockey sur glace @fr
type: Class

has Tennis League
related match: title
comment: Relation between Historic Place and Tennis League
range: tennis league
type: ObjectProperty
comment: Relazione tra Historic Place e Tennis League @it
domain: historic place

has Locomotive
range: locomotive
comment: Relazione tra Historic Place e Locomotive @it
comment: Relation between Historic Place and Locomotive
domain: historic place
type: ObjectProperty

Christian Bishop
type: Class
label: évêque chrétien @fr

mountain range
label: chaîne de montagne @fr
type: Class

beverage
label: boisson @fr
type: Class

has Launch Pad
comment: Relation between Historic Place and Launch Pad
comment: Relazione tra Historic Place e Launch Pad @it
range: launch pad
domain: historic place
type: ObjectProperty

Axiom
annotated target: museum
annotated source: has University
matching quantification: 1

has Ginkgo
comment: Relazione tra Historic Place e Ginkgo @it
type: ObjectProperty
comment: Relation between Historic Place and Ginkgo
range: ginkgo
domain: historic place

planet
label: planète @fr
type: Class

has Album
range: album
comment: Relazione tra Historic Place e Album @it
comment: Relation between Historic Place and Album
type: ObjectProperty
domain: historic place

has Senator
comment: Relazione tra Historic Place e Senator @it
comment: Relation between Historic Place and Senator
range: senator
type: ObjectProperty
domain: historic place

has Aircraft
comment: Relazione tra Historic Place e Aircraft @it
type: ObjectProperty
domain: historic place
comment: Relation between Historic Place and Aircraft
range: aircraft

has Election
range: Election
comment: Relazione tra Historic Place e Election @it
type: ObjectProperty
domain: historic place
comment: Relation between Historic Place and Election

has Trade Union
comment: Relation between Historic Place and Trade Union
type: ObjectProperty
comment: Relazione tra Historic Place e Trade Union @it
domain: historic place
range: trade union

scientist
label: scientifique @fr
label: Wissenschaftler @de
type: Class

has Hockey Team
range: hockey team
type: ObjectProperty
comment: Relazione tra Historic Place e Hockey Team @it
comment: Relation between Historic Place and Hockey Team
domain: historic place

has Musical Artist
comment: Relation between Historic Place and Musical Artist
range: musical artist
domain: historic place
comment: Relazione tra Historic Place e Musical Artist @it
type: ObjectProperty

golf league
label: ligue de golf @fr
type: Class

has American Football Player
domain: historic place
range: american football player
type: ObjectProperty
comment: Relazione tra Historic Place e American Football Player @it
comment: Relation between Historic Place and American Football Player

has Canal
range: canal
comment: Relazione tra Historic Place e Canal @it
domain: historic place
comment: Relation between Historic Place and Canal
type: ObjectProperty

has Music Genre
type: ObjectProperty
range: music genre
comment: Relation between Historic Place and Music Genre
domain: historic place
comment: Relazione tra Historic Place e Music Genre @it

olympics
label: Jeux Olympiques @fr
type: Class

has Historic Building
comment: Relazione tra Historic Place e Historic Building @it
domain: historic place
comment: Relation between Historic Place and Historic Building
type: ObjectProperty
range: historic building
related match: after

baseball league
label: ligue de baseball @fr
type: Class

Axiom
matching quantification: 1
annotated source: has Language
annotated target: nativetribe

has Crustacean
domain: historic place
comment: Relazione tra Historic Place e Crustacean @it
range: crustacean
type: ObjectProperty
comment: Relation between Historic Place and Crustacean

has Comics Creator
domain: historic place
range: comics creator
comment: Relazione tra Historic Place e Comics Creator @it
type: ObjectProperty
comment: Relation between Historic Place and Comics Creator

bridge
label: pont @fr
type: Class

has Band
comment: Relation between Historic Place and Band
domain: historic place
comment: Relazione tra Historic Place e Band @it
range: Band
type: ObjectProperty

has Ski Area
range: ski area
type: ObjectProperty
domain: historic place
comment: Relation between Historic Place and Ski Area
comment: Relazione tra Historic Place e Ski Area @it

broadcast
label: Émission de télévision @fr
type: Class

vein
type: Class
label: veine @fr

mammal
label: mammifère @fr
type: Class

has Nascar Driver
comment: Relazione tra Historic Place e Nascar Driver @it
range: nascar driver
comment: Relation between Historic Place and Nascar Driver
type: ObjectProperty
domain: historic place

island
label: île @fr
label: νησί @el
type: Class

has Stadium
type: ObjectProperty
comment: Relazione tra Historic Place e Stadium @it
range: stadium
comment: Relation between Historic Place and Stadium
domain: historic place
related match: after

has Television Episode
domain: historic place
comment: Relazione tra Historic Place e Television Episode @it
type: ObjectProperty
comment: Relation between Historic Place and Television Episode
range: television episode

comics character
type: Class
label: personnage de bandes dessinées @fr

Formula One racer
label: pilote de formule 1 @fr
type: Class

skyscraper
label: gratte-ciel @fr
type: Class

radio station
type: Class
label: station de radio @fr

member of parliament
label: membre du Parlement @fr
type: Class

bone
type: Class
label: Knochen @de
label: os @fr

has Cycad
comment: Relation between Historic Place and Cycad
comment: Relazione tra Historic Place e Cycad @it
domain: historic place
type: ObjectProperty
range: cycad

Axiom
matching quantification: 6
annotated target: architect
annotated source: has Architect

conifer
label: conifères @fr
type: Class

airport
label: aéroport @fr
label: Flughafen @de
type: Class