has Actor
range: actor
comment: Relation between Ice Hockey Player and Actor
comment: Relazione tra Ice Hockey Player e Actor @it
domain: ice hockey player
type: ObjectProperty
related match: after

Axiom
matching quantification: 1
annotated source: has Olympics
annotated target: years

television show
label: émission de télévision @fr
type: Class

disease
type: Class
label: maladie @fr

colour
type: Class
label: couleur @fr
label: χρώμα @el

automobile
type: Class

has Music Genre
comment: Relazione tra Ice Hockey Player e Music Genre @it
comment: Relation between Ice Hockey Player and Music Genre
domain: ice hockey player
type: ObjectProperty
range: music genre
related match: formerTeams

has Writer
comment: Relazione tra Ice Hockey Player e Writer @it
domain: ice hockey player
type: ObjectProperty
comment: Relation between Ice Hockey Player and Writer
range: writer

Election
label: élection @fr
type: Class

american football player
type: Class
label: joueur de football américain @fr

has Golf Player
domain: ice hockey player
comment: Relazione tra Ice Hockey Player e Golf Player @it
type: ObjectProperty
comment: Relation between Ice Hockey Player and Golf Player
range: golf player

has Ski Area
comment: Relazione tra Ice Hockey Player e Ski Area @it
domain: ice hockey player
type: ObjectProperty
range: ski area
comment: Relation between Ice Hockey Player and Ski Area

stadium
label: stade @fr
type: Class

soccer league
label: ligue de football @fr
type: Class

Axiom
annotated source: has Office Holder
matching quantification: 1
annotated target: after

has British Royalty
comment: Relazione tra Ice Hockey Player e British Royalty @it
type: ObjectProperty
domain: ice hockey player
range: British royalty
comment: Relation between Ice Hockey Player and British Royalty

has Playboy Playmate
type: ObjectProperty
comment: Relazione tra Ice Hockey Player e Playboy Playmate @it
range: Playboy Playmate
domain: ice hockey player
comment: Relation between Ice Hockey Player and Playboy Playmate

has Single
comment: Relazione tra Ice Hockey Player e Single @it
range: single
domain: ice hockey player
type: ObjectProperty
comment: Relation between Ice Hockey Player and Single

has Nascar Driver
type: ObjectProperty
comment: Relation between Ice Hockey Player and Nascar Driver
domain: ice hockey player
range: nascar driver
comment: Relazione tra Ice Hockey Player e Nascar Driver @it

wrestler
type: Class
label: lutteur @fr

mayor
type: Class
label: maire @fr

has Brain
domain: ice hockey player
comment: Relation between Ice Hockey Player and Brain
type: ObjectProperty
range: brain
comment: Relazione tra Ice Hockey Player e Brain @it

species
type: Class
label: espèce @fr

has Historic Place
range: historic place
type: ObjectProperty
comment: Relation between Ice Hockey Player and Historic Place
domain: ice hockey player
comment: Relazione tra Ice Hockey Player e Historic Place @it

newspaper
label: journal @fr
type: Class

Axiom
annotated source: has Music Genre
matching quantification: 1
annotated target: formerTeams

has Automobile
range: automobile
domain: ice hockey player
comment: Relazione tra Ice Hockey Player e Automobile @it
comment: Relation between Ice Hockey Player and Automobile
type: ObjectProperty

game
label: jeu @fr
type: Class

road
label: route @fr
type: Class

has Inline Hockey League
comment: Relation between Ice Hockey Player and Inline Hockey League
domain: ice hockey player
range: inline hockey league
type: ObjectProperty
comment: Relazione tra Ice Hockey Player e Inline Hockey League @it

boxer
type: Class
label: boxeur @fr

has Park
comment: Relazione tra Ice Hockey Player e Park @it
comment: Relation between Ice Hockey Player and Park
range: park
type: ObjectProperty
domain: ice hockey player

World Heritage Site
label: site du patrimoine mondial @fr
type: Class

Axiom
matching quantification: 4
annotated source: has Member Of Parliament
annotated target: after

has Beverage
comment: Relation between Ice Hockey Player and Beverage
domain: ice hockey player
type: ObjectProperty
range: beverage
comment: Relazione tra Ice Hockey Player e Beverage @it

station
type: Class

language
type: Class
label: langage @fr

tennis league
type: Class
label: ligue de tennis @fr

has Plant
domain: ice hockey player
comment: Relation between Ice Hockey Player and Plant
range: plant
type: ObjectProperty
comment: Relazione tra Ice Hockey Player e Plant @it

has Airport
type: ObjectProperty
range: airport
domain: ice hockey player
comment: Relation between Ice Hockey Player and Airport
comment: Relazione tra Ice Hockey Player e Airport @it

has Election
domain: ice hockey player
comment: Relazione tra Ice Hockey Player e Election @it
type: ObjectProperty
comment: Relation between Ice Hockey Player and Election
range: Election

lake
type: Class
label: lac @fr

has Model
range: model
type: ObjectProperty
comment: Relation between Ice Hockey Player and Model
comment: Relazione tra Ice Hockey Player e Model @it
domain: ice hockey player

has Aircraft
type: ObjectProperty
comment: Relation between Ice Hockey Player and Aircraft
domain: ice hockey player
comment: Relazione tra Ice Hockey Player e Aircraft @it
range: aircraft

has Office Holder
related match: after
comment: Relation between Ice Hockey Player and Office Holder
domain: ice hockey player
comment: Relazione tra Ice Hockey Player e Office Holder @it
type: ObjectProperty
range: office holder

governor
type: Class
label: gouverneur @fr

river
type: Class
label: rivière @fr

has Mountain
comment: Relazione tra Ice Hockey Player e Mountain @it
type: ObjectProperty
comment: Relation between Ice Hockey Player and Mountain
domain: ice hockey player
range: mountain

Axiom
annotated target: before
matching quantification: 1
annotated source: has Basketball Player

lacrosse league
type: Class
label: ligue de crosse @fr

school
type: Class
label: école @fr

ship
type: Class
label: navire @fr

fish
type: Class
label: poisson @fr

museum
label: musée @fr
type: Class

tennis player
label: joueur de tennis @fr
type: Class

video game
type: Class
label: jeux vidéo @fr

trade union
label: syndicat professionnel @fr
type: Class

has Basketball Team
type: ObjectProperty
comment: Relation between Ice Hockey Player and Basketball Team
comment: Relazione tra Ice Hockey Player e Basketball Team @it
domain: ice hockey player
range: basketball team

currency
label: devise @fr
type: Class

prime minister
type: Class
label: premier ministre @fr

British royalty
type: Class
label: royauté Britannique @fr

historic place
label: site historique @fr
type: Class

has Currency
domain: ice hockey player
comment: Relation between Ice Hockey Player and Currency
comment: Relazione tra Ice Hockey Player e Currency @it
range: currency
type: ObjectProperty

hospital
label: hôpital @fr
type: Class

has Trade Union
comment: Relation between Ice Hockey Player and Trade Union
type: ObjectProperty
range: trade union
comment: Relazione tra Ice Hockey Player e Trade Union @it
domain: ice hockey player

has Lacrosse League
comment: Relation between Ice Hockey Player and Lacrosse League
type: ObjectProperty
comment: Relazione tra Ice Hockey Player e Lacrosse League @it
range: lacrosse league
domain: ice hockey player

has Band
domain: ice hockey player
comment: Relazione tra Ice Hockey Player e Band @it
range: Band
type: ObjectProperty
comment: Relation between Ice Hockey Player and Band

has Bird
domain: ice hockey player
comment: Relazione tra Ice Hockey Player e Bird @it
range: bird
type: ObjectProperty
comment: Relation between Ice Hockey Player and Bird

has Website
range: website
type: ObjectProperty
comment: Relazione tra Ice Hockey Player e Website @it
domain: ice hockey player
comment: Relation between Ice Hockey Player and Website

continent
type: Class
label: ήπειρος @el

has Bridge
domain: ice hockey player
type: ObjectProperty
comment: Relation between Ice Hockey Player and Bridge
range: bridge
comment: Relazione tra Ice Hockey Player e Bridge @it

president
type: Class
label: président @fr

album
label: Album @de
type: Class

has Planet
comment: Relation between Ice Hockey Player and Planet
comment: Relazione tra Ice Hockey Player e Planet @it
type: ObjectProperty
domain: ice hockey player
range: planet

figure skater
label: patineur artistique @fr
type: Class

has Comics Character
range: comics character
comment: Relation between Ice Hockey Player and Comics Character
domain: ice hockey player
comment: Relazione tra Ice Hockey Player e Comics Character @it
type: ObjectProperty

has Governor
comment: Relazione tra Ice Hockey Player e Governor @it
type: ObjectProperty
range: governor
comment: Relation between Ice Hockey Player and Governor
domain: ice hockey player

has Senator
range: senator
type: ObjectProperty
comment: Relazione tra Ice Hockey Player e Senator @it
domain: ice hockey player
comment: Relation between Ice Hockey Player and Senator

military unit
label: unité militaire @fr
type: Class

soccer manager
label: entraîneur de football @fr
type: Class

basketball team
type: Class

has Hospital
comment: Relazione tra Ice Hockey Player e Hospital @it
domain: ice hockey player
comment: Relation between Ice Hockey Player and Hospital
type: ObjectProperty
range: hospital

canadian football team
type: Class
label: équipe canadienne de football américain @fr

music genre
label: genre musical @fr
label: género musical @pt
type: Class

writer
label: écrivain @fr
type: Class

has President
domain: ice hockey player
type: ObjectProperty
range: president
comment: Relazione tra Ice Hockey Player e President @it
comment: Relation between Ice Hockey Player and President

model
label: mannequin @fr
type: Class

has Journalist
range: journalist
comment: Relation between Ice Hockey Player and Journalist
comment: Relazione tra Ice Hockey Player e Journalist @it
domain: ice hockey player
type: ObjectProperty

has Mammal
comment: Relation between Ice Hockey Player and Mammal
comment: Relazione tra Ice Hockey Player e Mammal @it
range: mammal
domain: ice hockey player
type: ObjectProperty

has Film
comment: Relazione tra Ice Hockey Player e Film @it
comment: Relation between Ice Hockey Player and Film
type: ObjectProperty
range: film
domain: ice hockey player

olympic result
type: Class
label: résultat de Jeux Olympiques @fr

has Criminal
comment: Relation between Ice Hockey Player and Criminal
type: ObjectProperty
domain: ice hockey player
range: criminal
comment: Relazione tra Ice Hockey Player e Criminal @it

has Broadcast
comment: Relation between Ice Hockey Player and Broadcast
domain: ice hockey player
comment: Relazione tra Ice Hockey Player e Broadcast @it
type: ObjectProperty
range: broadcast

has Tennis League
domain: ice hockey player
comment: Relazione tra Ice Hockey Player e Tennis League @it
range: tennis league
type: ObjectProperty
comment: Relation between Ice Hockey Player and Tennis League

has Prime Minister
domain: ice hockey player
comment: Relazione tra Ice Hockey Player e Prime Minister @it
range: prime minister
comment: Relation between Ice Hockey Player and Prime Minister
type: ObjectProperty

has Baseball League
comment: Relation between Ice Hockey Player and Baseball League
type: ObjectProperty
domain: ice hockey player
range: baseball league
comment: Relazione tra Ice Hockey Player e Baseball League @it

comics creator
type: Class
label: créateur de bandes dessinées @fr

aircraft
label: αεροσκάφος @el
type: Class
label: avion @fr

has Vein
range: vein
domain: ice hockey player
comment: Relation between Ice Hockey Player and Vein
type: ObjectProperty
comment: Relazione tra Ice Hockey Player e Vein @it

soccer player
label: joueur de football @fr
type: Class

has Drug
domain: ice hockey player
type: ObjectProperty
comment: Relazione tra Ice Hockey Player e Drug @it
comment: Relation between Ice Hockey Player and Drug
range: drug

has Basketball Player
related match: before
type: ObjectProperty
range: basketball player
comment: Relazione tra Ice Hockey Player e Basketball Player @it
domain: ice hockey player
comment: Relation between Ice Hockey Player and Basketball Player

has Game
comment: Relation between Ice Hockey Player and Game
domain: ice hockey player
range: game
comment: Relazione tra Ice Hockey Player e Game @it
type: ObjectProperty

reptile
type: Class

legislature
label: pouvoir législatif @fr
type: Class

has Award
domain: ice hockey player
range: award
type: ObjectProperty
comment: Relation between Ice Hockey Player and Award
comment: Relazione tra Ice Hockey Player e Award @it

airline
label: compagnie aérienne @fr
type: Class

golf player
label: golfeur @fr
type: Class

nascar driver
label: pilote de la nascar @fr
type: Class

journalist
type: Class
label: journaliste @fr

has Figure Skater
comment: Relazione tra Ice Hockey Player e Figure Skater @it
range: figure skater
domain: ice hockey player
comment: Relation between Ice Hockey Player and Figure Skater
type: ObjectProperty

has Olympic Result
comment: Relazione tra Ice Hockey Player e Olympic Result @it
type: ObjectProperty
domain: ice hockey player
comment: Relation between Ice Hockey Player and Olympic Result
range: olympic result

has Historic Building
domain: ice hockey player
comment: Relation between Ice Hockey Player and Historic Building
comment: Relazione tra Ice Hockey Player e Historic Building @it
range: historic building
type: ObjectProperty

film
label: ταινία @el
type: Class

has Skyscraper
domain: ice hockey player
range: skyscraper
type: ObjectProperty
comment: Relation between Ice Hockey Player and Skyscraper
comment: Relazione tra Ice Hockey Player e Skyscraper @it

has Military Conflict
comment: Relazione tra Ice Hockey Player e Military Conflict @it
comment: Relation between Ice Hockey Player and Military Conflict
range: military conflict
domain: ice hockey player
type: ObjectProperty

american football team
label: équipe américaine de football américain @fr
type: Class

has Basketball League
type: ObjectProperty
range: basketball league
domain: ice hockey player
comment: Relazione tra Ice Hockey Player e Basketball League @it
comment: Relation between Ice Hockey Player and Basketball League

Supreme Court of the United States case
label: cas juridique de la Cour suprême des États-Unis @fr
type: Class

bird
type: Class
label: oiseau @fr

has Military Person
comment: Relazione tra Ice Hockey Player e Military Person @it
type: ObjectProperty
domain: ice hockey player
comment: Relation between Ice Hockey Player and Military Person
range: military person

chemical compound
type: Class
label: produit chimique @fr

has School
domain: ice hockey player
range: school
comment: Relazione tra Ice Hockey Player e School @it
comment: Relation between Ice Hockey Player and School
type: ObjectProperty

musical artist
label: musicien @fr
type: Class
label: artista musical @pt

has Ethnic Group
range: ethnic group
domain: ice hockey player
type: ObjectProperty
comment: Relazione tra Ice Hockey Player e Ethnic Group @it
comment: Relation between Ice Hockey Player and Ethnic Group

park
type: Class
label: parc @fr

brain
label: cerveau @fr
type: Class

rugby player
label: joueur de rugby @fr
type: Class

has World Heritage Site
comment: Relation between Ice Hockey Player and World Heritage Site
comment: Relazione tra Ice Hockey Player e World Heritage Site @it
range: World Heritage Site
domain: ice hockey player
type: ObjectProperty

has Rugby League
range: rugby league
domain: ice hockey player
comment: Relazione tra Ice Hockey Player e Rugby League @it
type: ObjectProperty
comment: Relation between Ice Hockey Player and Rugby League

has Muscle
range: muscle
domain: ice hockey player
comment: Relation between Ice Hockey Player and Muscle
type: ObjectProperty
comment: Relazione tra Ice Hockey Player e Muscle @it

has Non- Profit Organisation
comment: Relazione tra Ice Hockey Player e Non- Profit Organisation @it
comment: Relation between Ice Hockey Player and Non- Profit Organisation
range: non-profit organisation
type: ObjectProperty
domain: ice hockey player

american football league
type: Class

has Mayor
comment: Relation between Ice Hockey Player and Mayor
type: ObjectProperty
range: mayor
comment: Relazione tra Ice Hockey Player e Mayor @it
domain: ice hockey player

musical
type: Class
label: musique @fr

has Book
domain: ice hockey player
comment: Relation between Ice Hockey Player and Book
range: book
comment: Relazione tra Ice Hockey Player e Book @it
type: ObjectProperty

has Cricketer
comment: Relazione tra Ice Hockey Player e Cricketer @it
domain: ice hockey player
range: cricketer
type: ObjectProperty
comment: Relation between Ice Hockey Player and Cricketer

actor
label: acteur @fr
type: Class
label: Schauspieler @de

cyclist
type: Class
label: cycliste @fr

Axiom
matching quantification: 3
annotated source: has Soccer Club
annotated target: formerTeams

wrestling event
label: match de catch @fr
type: Class

basketball league
label: ligue de basketball @fr
type: Class

mountain
type: Class
label: montagne @fr
label: Βουνό @el

criminal
label: criminel @fr
type: Class

has Formula One Racer
comment: Relation between Ice Hockey Player and Formula One Racer
range: Formula One racer
comment: Relazione tra Ice Hockey Player e Formula One Racer @it
type: ObjectProperty
domain: ice hockey player

senator
label: sénateur @fr
type: Class

comedian
label: comédien @fr
type: Class

has Baseball Player
range: baseball player
type: ObjectProperty
comment: Relazione tra Ice Hockey Player e Baseball Player @it
comment: Relation between Ice Hockey Player and Baseball Player
domain: ice hockey player
related match: after

Playboy Playmate
type: Class
label: playmate pour Playboy @fr

book
label: llibre @ca
label: książka @pl
label: βιβλίο @el
label: livre @fr
type: Class

has Road
comment: Relation between Ice Hockey Player and Road
type: ObjectProperty
domain: ice hockey player
range: road
comment: Relazione tra Ice Hockey Player e Road @it

Axiom
annotated target: after
annotated source: has American Football Player
matching quantification: 2

has Village
comment: Relazione tra Ice Hockey Player e Village @it
comment: Relation between Ice Hockey Player and Village
domain: ice hockey player
type: ObjectProperty
range: village

has Comics Creator
comment: Relation between Ice Hockey Player and Comics Creator
range: comics creator
type: ObjectProperty
comment: Relazione tra Ice Hockey Player e Comics Creator @it
domain: ice hockey player

shopping mall
type: Class
label: centre commercial @fr

has Supreme Court Of The United States Case
type: ObjectProperty
range: Supreme Court of the United States case
comment: Relazione tra Ice Hockey Player e Supreme Court Of The United States Case @it
domain: ice hockey player
comment: Relation between Ice Hockey Player and Supreme Court Of The United States Case

has Nerve
type: ObjectProperty
comment: Relazione tra Ice Hockey Player e Nerve @it
range: nerve
comment: Relation between Ice Hockey Player and Nerve
domain: ice hockey player

has Language
comment: Relation between Ice Hockey Player and Language
comment: Relazione tra Ice Hockey Player e Language @it
domain: ice hockey player
range: language
type: ObjectProperty

has Military Unit
comment: Relazione tra Ice Hockey Player e Military Unit @it
domain: ice hockey player
comment: Relation between Ice Hockey Player and Military Unit
type: ObjectProperty
range: military unit

ski area
type: Class
label: domaine skiable @fr

has Boxer
range: boxer
comment: Relazione tra Ice Hockey Player e Boxer @it
domain: ice hockey player
comment: Relation between Ice Hockey Player and Boxer
type: ObjectProperty

has Scientist
type: ObjectProperty
range: scientist
comment: Relation between Ice Hockey Player and Scientist
comment: Relazione tra Ice Hockey Player e Scientist @it
domain: ice hockey player

non-profit organisation
label: organisation à but non lucratif @fr
type: Class

has Cyclist
comment: Relation between Ice Hockey Player and Cyclist
range: cyclist
domain: ice hockey player
comment: Relazione tra Ice Hockey Player e Cyclist @it
type: ObjectProperty

has College Coach
comment: Relation between Ice Hockey Player and College Coach
domain: ice hockey player
range: college coach
comment: Relazione tra Ice Hockey Player e College Coach @it
type: ObjectProperty

canadian football league
type: Class

rugby league
label: ligue de rugby @fr
type: Class

has American Football Player
related match: after
related match: years
comment: Relation between Ice Hockey Player and American Football Player
comment: Relazione tra Ice Hockey Player e American Football Player @it
type: ObjectProperty
range: american football player
domain: ice hockey player

has Canadian Football League
type: ObjectProperty
domain: ice hockey player
comment: Relation between Ice Hockey Player and Canadian Football League
range: canadian football league
comment: Relazione tra Ice Hockey Player e Canadian Football League @it

has Stadium
domain: ice hockey player
type: ObjectProperty
comment: Relazione tra Ice Hockey Player e Stadium @it
range: stadium
comment: Relation between Ice Hockey Player and Stadium

weapon
label: arme @fr
type: Class

drug
type: Class
label: médicament @fr

has Magazine
comment: Relazione tra Ice Hockey Player e Magazine @it
type: ObjectProperty
comment: Relation between Ice Hockey Player and Magazine
range: magazine
domain: ice hockey player

has Species
comment: Relazione tra Ice Hockey Player e Species @it
range: species
domain: ice hockey player
comment: Relation between Ice Hockey Player and Species
type: ObjectProperty

has Bone
range: bone
comment: Relation between Ice Hockey Player and Bone
domain: ice hockey player
comment: Relazione tra Ice Hockey Player e Bone @it
type: ObjectProperty

magazine
label: περιοδικό @el
type: Class

has Shopping Mall
comment: Relation between Ice Hockey Player and Shopping Mall
domain: ice hockey player
type: ObjectProperty
comment: Relazione tra Ice Hockey Player e Shopping Mall @it
range: shopping mall

has Soccer Manager
domain: ice hockey player
comment: Relation between Ice Hockey Player and Soccer Manager
range: soccer manager
type: ObjectProperty
comment: Relazione tra Ice Hockey Player e Soccer Manager @it

has Station
type: ObjectProperty
domain: ice hockey player
comment: Relation between Ice Hockey Player and Station
range: station
comment: Relazione tra Ice Hockey Player e Station @it

military person
type: Class
label: militaire @fr

has Newspaper
comment: Relazione tra Ice Hockey Player e Newspaper @it
comment: Relation between Ice Hockey Player and Newspaper
domain: ice hockey player
range: newspaper
type: ObjectProperty

award
type: Class
label: récompense @fr

has Artery
comment: Relation between Ice Hockey Player and Artery
range: artery
type: ObjectProperty
domain: ice hockey player
comment: Relazione tra Ice Hockey Player e Artery @it

has Canadian Football Team
domain: ice hockey player
comment: Relation between Ice Hockey Player and Canadian Football Team
type: ObjectProperty
comment: Relazione tra Ice Hockey Player e Canadian Football Team @it
range: canadian football team

cricketer
label: joueur de cricket @fr
type: Class

nerve
type: Class
label: nerf @fr

single
type: Class

Band
label: banda @pt
label: Musikgruppe @de
type: Class
label: groupe de musique @fr

town
type: Class
label: ville @fr

Axiom
annotated source: has Soccer Club
matching quantification: 2
annotated target: playedFor

ethnic group
label: groupe ethnique @fr
type: Class

artery
label: artère @fr
type: Class
label: Arterie @de

has Museum
comment: Relation between Ice Hockey Player and Museum
domain: ice hockey player
comment: Relazione tra Ice Hockey Player e Museum @it
type: ObjectProperty
range: museum

has Video Game
range: video game
domain: ice hockey player
comment: Relation between Ice Hockey Player and Video Game
comment: Relazione tra Ice Hockey Player e Video Game @it
type: ObjectProperty

college coach
label: entraîneur universitaire @fr
type: Class

has Fish
comment: Relation between Ice Hockey Player and Fish
type: ObjectProperty
range: fish
comment: Relazione tra Ice Hockey Player e Fish @it
domain: ice hockey player

muscle
type: Class

has Olympics
related match: years
comment: Relazione tra Ice Hockey Player e Olympics @it
range: olympics
comment: Relation between Ice Hockey Player and Olympics
type: ObjectProperty
domain: ice hockey player

has Rugby Player
comment: Relation between Ice Hockey Player and Rugby Player
range: rugby player
type: ObjectProperty
comment: Relazione tra Ice Hockey Player e Rugby Player @it
domain: ice hockey player

village
label: χωριό @el
type: Class

has Soccer Club
related match: playedFor
related match: formerTeams
range: soccer club
type: ObjectProperty
domain: ice hockey player
comment: Relazione tra Ice Hockey Player e Soccer Club @it
comment: Relation between Ice Hockey Player and Soccer Club

has Weapon
comment: Relazione tra Ice Hockey Player e Weapon @it
type: ObjectProperty
range: weapon
domain: ice hockey player
comment: Relation between Ice Hockey Player and Weapon

inline hockey league
type: Class
label: ligue de roller inline hockey @fr

soccer club
label: club de football @fr
type: Class

has Chemical Compound
domain: ice hockey player
range: chemical compound
type: ObjectProperty
comment: Relation between Ice Hockey Player and Chemical Compound
comment: Relazione tra Ice Hockey Player e Chemical Compound @it

has Island
comment: Relation between Ice Hockey Player and Island
domain: ice hockey player
type: ObjectProperty
comment: Relazione tra Ice Hockey Player e Island @it
range: island

has Continent
comment: Relazione tra Ice Hockey Player e Continent @it
comment: Relation between Ice Hockey Player and Continent
range: continent
domain: ice hockey player
type: ObjectProperty

has Soccer League
domain: ice hockey player
comment: Relazione tra Ice Hockey Player e Soccer League @it
range: soccer league
type: ObjectProperty
comment: Relation between Ice Hockey Player and Soccer League

historic building
type: Class
label: bâtiment historique @fr

has Radio Station
type: ObjectProperty
range: radio station
comment: Relazione tra Ice Hockey Player e Radio Station @it
domain: ice hockey player
comment: Relation between Ice Hockey Player and Radio Station

office holder
type: Class
label: Amtsinhaber @de
label: titulaire @fr

baseball player
type: Class
label: joueur de baseball @fr

has Reptile
domain: ice hockey player
type: ObjectProperty
comment: Relation between Ice Hockey Player and Reptile
range: reptile
comment: Relazione tra Ice Hockey Player e Reptile @it

military conflict
label: conflit militaire @fr
type: Class

website
type: Class
label: Ιστότοπος @el
label: site web @fr

has Golf League
type: ObjectProperty
comment: Relazione tra Ice Hockey Player e Golf League @it
comment: Relation between Ice Hockey Player and Golf League
domain: ice hockey player
range: golf league

has Ship
comment: Relazione tra Ice Hockey Player e Ship @it
type: ObjectProperty
comment: Relation between Ice Hockey Player and Ship
range: ship
domain: ice hockey player

has Town
comment: Relazione tra Ice Hockey Player e Town @it
domain: ice hockey player
comment: Relation between Ice Hockey Player and Town
range: town
type: ObjectProperty

has Soccer Player
comment: Relazione tra Ice Hockey Player e Soccer Player @it
range: soccer player
type: ObjectProperty
domain: ice hockey player
comment: Relation between Ice Hockey Player and Soccer Player

Axiom
matching quantification: 1
annotated source: has American Football Player
annotated target: years

basketball player
label: joueur de basketball @fr
type: Class

has Legislature
comment: Relation between Ice Hockey Player and Legislature
range: legislature
type: ObjectProperty
domain: ice hockey player
comment: Relazione tra Ice Hockey Player e Legislature @it

ice hockey player
label: joueur de hockey sur glace @fr
type: Class

mountain range
type: Class
label: chaîne de montagne @fr

has River
type: ObjectProperty
range: river
comment: Relazione tra Ice Hockey Player e River @it
domain: ice hockey player
comment: Relation between Ice Hockey Player and River

has Lake
range: lake
domain: ice hockey player
comment: Relation between Ice Hockey Player and Lake
type: ObjectProperty
comment: Relazione tra Ice Hockey Player e Lake @it

beverage
label: boisson @fr
type: Class

has American Football Team
type: ObjectProperty
comment: Relazione tra Ice Hockey Player e American Football Team @it
range: american football team
comment: Relation between Ice Hockey Player and American Football Team
domain: ice hockey player

Axiom
annotated source: has Baseball Player
matching quantification: 1
annotated target: after

planet
label: planète @fr
type: Class

has Airline
range: airline
comment: Relation between Ice Hockey Player and Airline
domain: ice hockey player
comment: Relazione tra Ice Hockey Player e Airline @it
type: ObjectProperty

has Mountain Range
comment: Relation between Ice Hockey Player and Mountain Range
range: mountain range
comment: Relazione tra Ice Hockey Player e Mountain Range @it
domain: ice hockey player
type: ObjectProperty

has Colour
comment: Relation between Ice Hockey Player and Colour
comment: Relazione tra Ice Hockey Player e Colour @it
domain: ice hockey player
type: ObjectProperty
range: colour

has Musical
range: musical
type: ObjectProperty
domain: ice hockey player
comment: Relazione tra Ice Hockey Player e Musical @it
comment: Relation between Ice Hockey Player and Musical

scientist
label: Wissenschaftler @de
type: Class
label: scientifique @fr

has Wrestler
range: wrestler
domain: ice hockey player
comment: Relazione tra Ice Hockey Player e Wrestler @it
comment: Relation between Ice Hockey Player and Wrestler
type: ObjectProperty

golf league
type: Class
label: ligue de golf @fr

has Comedian
comment: Relazione tra Ice Hockey Player e Comedian @it
type: ObjectProperty
domain: ice hockey player
comment: Relation between Ice Hockey Player and Comedian
range: comedian

olympics
type: Class
label: Jeux Olympiques @fr

baseball league
type: Class
label: ligue de baseball @fr

has American Football League
comment: Relazione tra Ice Hockey Player e American Football League @it
domain: ice hockey player
type: ObjectProperty
range: american football league
comment: Relation between Ice Hockey Player and American Football League

bridge
type: Class
label: pont @fr

plant
type: Class
label: plante @fr

broadcast
label: Émission de télévision @fr
type: Class

has Tennis Player
comment: Relazione tra Ice Hockey Player e Tennis Player @it
range: tennis player
comment: Relation between Ice Hockey Player and Tennis Player
domain: ice hockey player
type: ObjectProperty

Axiom
annotated target: after
matching quantification: 1
annotated source: has Actor

has Album
comment: Relazione tra Ice Hockey Player e Album @it
comment: Relation between Ice Hockey Player and Album
domain: ice hockey player
range: album
type: ObjectProperty

vein
type: Class
label: veine @fr

mammal
label: mammifère @fr
type: Class

island
type: Class
label: νησί @el
label: île @fr

has Disease
domain: ice hockey player
comment: Relazione tra Ice Hockey Player e Disease @it
type: ObjectProperty
range: disease
comment: Relation between Ice Hockey Player and Disease

comics character
type: Class
label: personnage de bandes dessinées @fr

skyscraper
type: Class
label: gratte-ciel @fr

Formula One racer
label: pilote de formule 1 @fr
type: Class

has Musical Artist
type: ObjectProperty
range: musical artist
domain: ice hockey player
comment: Relation between Ice Hockey Player and Musical Artist
comment: Relazione tra Ice Hockey Player e Musical Artist @it

has Member Of Parliament
related match: after
type: ObjectProperty
domain: ice hockey player
comment: Relazione tra Ice Hockey Player e Member Of Parliament @it
range: member of parliament
comment: Relation between Ice Hockey Player and Member Of Parliament

radio station
label: station de radio @fr
type: Class

Ontology
has author: Andrea Giovanni Nuzzolese
has author: Valentina Presutti
comment: IceHockeyPlayer Encyclopedic Knowledge Pattern
imports: cpannotationschema.owl
has author: Aldo Gangemi
extracted from: en.wikipedia.org
has intent: To represent the encyclopedic knowledge expressed by an object typed as IceHockeyPlayer
extracted from: dbpedia.org

has Wrestling Event
range: wrestling event
comment: Relation between Ice Hockey Player and Wrestling Event
type: ObjectProperty
comment: Relazione tra Ice Hockey Player e Wrestling Event @it
domain: ice hockey player

bone
label: os @fr
label: Knochen @de
type: Class

member of parliament
type: Class
label: membre du Parlement @fr

has Television Show
comment: Relazione tra Ice Hockey Player e Television Show @it
range: television show
domain: ice hockey player
type: ObjectProperty
comment: Relation between Ice Hockey Player and Television Show

airport
type: Class
label: Flughafen @de
label: aéroport @fr