has Moss
type: ObjectProperty
range: moss
comment: Relazione tra Infrastructure e Moss @it
comment: Relation between Infrastructure and Moss
domain: infrastructure

has Airline
comment: Relation between Infrastructure and Airline
comment: Relazione tra Infrastructure e Airline @it
domain: infrastructure
type: ObjectProperty
range: airline

has Shopping Mall
type: ObjectProperty
range: shopping mall
domain: infrastructure
comment: Relazione tra Infrastructure e Shopping Mall @it
comment: Relation between Infrastructure and Shopping Mall

television show
type: Class
label: émission de télévision @fr

rocket
label: fusée @fr
type: Class

disease
label: maladie @fr
type: Class

Axiom
annotated source: has Eukaryote
matching quantification: 1
annotated target: cities

has Canal
range: canal
comment: Relazione tra Infrastructure e Canal @it
type: ObjectProperty
comment: Relation between Infrastructure and Canal
domain: infrastructure

has Musical Artist
comment: Relazione tra Infrastructure e Musical Artist @it
type: ObjectProperty
domain: infrastructure
comment: Relation between Infrastructure and Musical Artist
range: musical artist

automobile
type: Class

colour
label: χρώμα @el
label: couleur @fr
type: Class

Axiom
annotated source: has Company
matching quantification: 26
annotated target: owner

Election
label: élection @fr
type: Class

has Country
related match: location
comment: Relazione tra Infrastructure e Country @it
domain: infrastructure
type: ObjectProperty
range: country
comment: Relation between Infrastructure and Country

Ontology
has intent: To represent the encyclopedic knowledge expressed by an object typed as Infrastructure
has author: Aldo Gangemi
imports: cpannotationschema.owl
has author: Andrea Giovanni Nuzzolese
extracted from: dbpedia.org
has author: Valentina Presutti
extracted from: en.wikipedia.org
comment: Infrastructure Encyclopedic Knowledge Pattern

american football player
type: Class
label: joueur de football américain @fr

stadium
label: stade @fr
type: Class

has Chemical Compound
comment: Relation between Infrastructure and Chemical Compound
comment: Relazione tra Infrastructure e Chemical Compound @it
range: chemical compound
domain: infrastructure
type: ObjectProperty
related match: fuelType

has River
related match: road
related match: river
range: river
domain: infrastructure
comment: Relation between Infrastructure and River
comment: Relazione tra Infrastructure e River @it
type: ObjectProperty

has Mollusca
type: ObjectProperty
comment: Relazione tra Infrastructure e Mollusca @it
range: mollusca
domain: infrastructure
comment: Relation between Infrastructure and Mollusca

astronaut
type: Class
label: Astronaut @de
label: astronaute @fr

has Journalist
type: ObjectProperty
domain: infrastructure
comment: Relazione tra Infrastructure e Journalist @it
range: journalist
comment: Relation between Infrastructure and Journalist

has Reptile
type: ObjectProperty
range: reptile
comment: Relazione tra Infrastructure e Reptile @it
comment: Relation between Infrastructure and Reptile
domain: infrastructure

has College Coach
type: ObjectProperty
comment: Relazione tra Infrastructure e College Coach @it
comment: Relation between Infrastructure and College Coach
domain: infrastructure
range: college coach

has Hospital
range: hospital
domain: infrastructure
type: ObjectProperty
comment: Relation between Infrastructure and Hospital
comment: Relazione tra Infrastructure e Hospital @it

Site of Special Scientific Interest
type: Class
label: site d'intérêt scientifique particulier @fr

has Cave
range: cave
domain: infrastructure
type: ObjectProperty
comment: Relation between Infrastructure and Cave
comment: Relazione tra Infrastructure e Cave @it

wrestler
label: lutteur @fr
type: Class

mayor
type: Class
label: maire @fr

amphibian
type: Class
label: amphibien @fr

has Ethnic Group
range: ethnic group
comment: Relazione tra Infrastructure e Ethnic Group @it
type: ObjectProperty
domain: infrastructure
comment: Relation between Infrastructure and Ethnic Group

has Video Game
comment: Relation between Infrastructure and Video Game
comment: Relazione tra Infrastructure e Video Game @it
domain: infrastructure
type: ObjectProperty
range: video game

has Museum
comment: Relazione tra Infrastructure e Museum @it
range: museum
type: ObjectProperty
domain: infrastructure
comment: Relation between Infrastructure and Museum

has Congressman
type: ObjectProperty
comment: Relation between Infrastructure and Congressman
domain: infrastructure
comment: Relazione tra Infrastructure e Congressman @it
range: congressman

newspaper
label: journal @fr
type: Class

has Architect
type: ObjectProperty
comment: Relation between Infrastructure and Architect
comment: Relazione tra Infrastructure e Architect @it
domain: infrastructure
range: architect

protected area
label: aire protégée @fr
label: προστατευμένη περιοχή @el
type: Class

has Single
comment: Relation between Infrastructure and Single
comment: Relazione tra Infrastructure e Single @it
range: single
type: ObjectProperty
domain: infrastructure

boxer
type: Class
label: boxeur @fr

judge
label: juge @fr
type: Class

World Heritage Site
type: Class
label: site du patrimoine mondial @fr

Axiom
matching quantification: 2
annotated source: has Building
annotated target: terminusB

language
type: Class
label: langage @fr

station
type: Class

has Radio Station
domain: infrastructure
comment: Relazione tra Infrastructure e Radio Station @it
comment: Relation between Infrastructure and Radio Station
range: radio station
type: ObjectProperty

has Station
domain: infrastructure
comment: Relation between Infrastructure and Station
range: station
comment: Relazione tra Infrastructure e Station @it
type: ObjectProperty

has Convention
comment: Relazione tra Infrastructure e Convention @it
type: ObjectProperty
range: convention
domain: infrastructure
comment: Relation between Infrastructure and Convention

has Ice Hockey Player
range: ice hockey player
type: ObjectProperty
comment: Relation between Infrastructure and Ice Hockey Player
domain: infrastructure
comment: Relazione tra Infrastructure e Ice Hockey Player @it

lake
type: Class
label: lac @fr

body of water
label: étendue d'eau @fr
type: Class

has Company
related match: owner
related match: terminusA
related match: operator
comment: Relation between Infrastructure and Company
type: ObjectProperty
domain: infrastructure
comment: Relazione tra Infrastructure e Company @it
range: company

has British Royalty
comment: Relazione tra Infrastructure e British Royalty @it
range: British royalty
type: ObjectProperty
comment: Relation between Infrastructure and British Royalty
domain: infrastructure

has Place
comment: Relazione tra Infrastructure e Place @it
related match: regions
related match: terminusA
related match: provinces
related match: counties
related match: locationSpecial
related match: beltwayCity
domain: infrastructure
related match: bridge
related match: road
type: ObjectProperty
related match: towns
range: place
related match: river
related match: terminusB
related match: location
comment: Relation between Infrastructure and Place
related match: http://dbpedia.org/property/n
related match: countySpecial
related match: destinations
related match: maint
related match: cities
related match: junction

governor
type: Class
label: gouverneur @fr

has American Football League
range: american football league
comment: Relazione tra Infrastructure e American Football League @it
comment: Relation between Infrastructure and American Football League
type: ObjectProperty
domain: infrastructure

has Military Person
domain: infrastructure
range: military person
comment: Relation between Infrastructure and Military Person
comment: Relazione tra Infrastructure e Military Person @it
type: ObjectProperty

has University
domain: infrastructure
range: university
comment: Relazione tra Infrastructure e University @it
type: ObjectProperty
comment: Relation between Infrastructure and University
related match: terminusA
related match: destinations

has Politician
range: politician
comment: Relation between Infrastructure and Politician
type: ObjectProperty
comment: Relazione tra Infrastructure e Politician @it
domain: infrastructure

has Rugby Player
comment: Relazione tra Infrastructure e Rugby Player @it
type: ObjectProperty
comment: Relation between Infrastructure and Rugby Player
domain: infrastructure
range: rugby player

river
type: Class
label: rivière @fr

has Skyscraper
range: skyscraper
domain: infrastructure
comment: Relation between Infrastructure and Skyscraper
comment: Relazione tra Infrastructure e Skyscraper @it
type: ObjectProperty

school
label: école @fr
type: Class

country
type: Class
label: χώρα @el
label: Staat @de
label: pays @fr

museum
type: Class
label: musée @fr

ship
label: navire @fr
type: Class

fish
label: poisson @fr
type: Class

video game
type: Class
label: jeux vidéo @fr

has Continent
domain: infrastructure
comment: Relation between Infrastructure and Continent
type: ObjectProperty
range: continent
comment: Relazione tra Infrastructure e Continent @it

trade union
type: Class
label: syndicat professionnel @fr

currency
label: devise @fr
type: Class

prime minister
label: premier ministre @fr
type: Class

British royalty
label: royauté Britannique @fr
type: Class

historic place
label: site historique @fr
type: Class

race
label: course @fr
type: Class

has School
comment: Relazione tra Infrastructure e School @it
domain: infrastructure
range: school
type: ObjectProperty
comment: Relation between Infrastructure and School

hospital
type: Class
label: hôpital @fr

has Airport
related match: cities
comment: Relation between Infrastructure and Airport
related match: destinations
domain: infrastructure
type: ObjectProperty
related match: terminusB
related match: location
range: airport
comment: Relazione tra Infrastructure e Airport @it
related match: junction

has Eukaryote
related match: cities
comment: Relazione tra Infrastructure e Eukaryote @it
range: eukaryote
domain: infrastructure
comment: Relation between Infrastructure and Eukaryote
type: ObjectProperty

monument
type: Class

has Christian Bishop
range: Christian Bishop
type: ObjectProperty
comment: Relazione tra Infrastructure e Christian Bishop @it
comment: Relation between Infrastructure and Christian Bishop
domain: infrastructure

has Monarch
domain: infrastructure
range: monarch
comment: Relazione tra Infrastructure e Monarch @it
type: ObjectProperty
comment: Relation between Infrastructure and Monarch

has Legislature
type: ObjectProperty
range: legislature
domain: infrastructure
comment: Relation between Infrastructure and Legislature
comment: Relazione tra Infrastructure e Legislature @it

has Site Of Special Scientific Interest
type: ObjectProperty
comment: Relazione tra Infrastructure e Site Of Special Scientific Interest @it
comment: Relation between Infrastructure and Site Of Special Scientific Interest
range: Site of Special Scientific Interest
domain: infrastructure

has Fictional Character
comment: Relation between Infrastructure and Fictional Character
domain: infrastructure
comment: Relazione tra Infrastructure e Fictional Character @it
range: fictional character
type: ObjectProperty

Axiom
annotated target: river
annotated source: has River
matching quantification: 1

Axiom
matching quantification: 1
annotated target: river
annotated source: has Stream

continent
label: ήπειρος @el
type: Class

has Television Show
range: television show
comment: Relazione tra Infrastructure e Television Show @it
domain: infrastructure
type: ObjectProperty
comment: Relation between Infrastructure and Television Show

has Cricketer
range: cricketer
domain: infrastructure
comment: Relazione tra Infrastructure e Cricketer @it
comment: Relation between Infrastructure and Cricketer
type: ObjectProperty

has Soccer Club
type: ObjectProperty
domain: infrastructure
range: soccer club
comment: Relation between Infrastructure and Soccer Club
comment: Relazione tra Infrastructure e Soccer Club @it

album
label: Album @de
type: Class

president
type: Class
label: président @fr

moss
type: Class
label: mousses @fr

has Soccer Player
comment: Relation between Infrastructure and Soccer Player
range: soccer player
type: ObjectProperty
domain: infrastructure
comment: Relazione tra Infrastructure e Soccer Player @it

person
label: personne @fr
label: pessoa @pt
label: Person @de
type: Class

has Conifer
comment: Relation between Infrastructure and Conifer
domain: infrastructure
type: ObjectProperty
range: conifer
comment: Relazione tra Infrastructure e Conifer @it

has Actor
domain: infrastructure
comment: Relation between Infrastructure and Actor
type: ObjectProperty
range: actor
comment: Relazione tra Infrastructure e Actor @it

military unit
type: Class
label: unité militaire @fr

has Music Festival
comment: Relation between Infrastructure and Music Festival
comment: Relazione tra Infrastructure e Music Festival @it
range: music festival
domain: infrastructure
type: ObjectProperty

soccer manager
label: entraîneur de football @fr
type: Class

has Ambassador
type: ObjectProperty
comment: Relazione tra Infrastructure e Ambassador @it
domain: infrastructure
comment: Relation between Infrastructure and Ambassador
range: ambassador

basketball team
type: Class

Axiom
annotated source: has Protected Area
matching quantification: 1
annotated target: road

has Book
range: book
type: ObjectProperty
comment: Relazione tra Infrastructure e Book @it
comment: Relation between Infrastructure and Book
domain: infrastructure

music genre
label: genre musical @fr
label: género musical @pt
type: Class

has Band
range: Band
comment: Relation between Infrastructure and Band
comment: Relazione tra Infrastructure e Band @it
domain: infrastructure
type: ObjectProperty

has Member Of Parliament
range: member of parliament
type: ObjectProperty
comment: Relation between Infrastructure and Member Of Parliament
domain: infrastructure
comment: Relazione tra Infrastructure e Member Of Parliament @it

has Mountain
type: ObjectProperty
range: mountain
domain: infrastructure
comment: Relazione tra Infrastructure e Mountain @it
comment: Relation between Infrastructure and Mountain
related match: location

writer
type: Class
label: écrivain @fr

Axiom
matching quantification: 10
annotated target: destinations
annotated source: has Airport

record label
type: Class
label: label discographique @fr

architect
label: architecte @fr
type: Class

ambassador
type: Class
label: ambassadeur @fr

has Comedian
comment: Relation between Infrastructure and Comedian
comment: Relazione tra Infrastructure e Comedian @it
domain: infrastructure
type: ObjectProperty
range: comedian

has Prime Minister
type: ObjectProperty
comment: Relation between Infrastructure and Prime Minister
comment: Relazione tra Infrastructure e Prime Minister @it
domain: infrastructure
range: prime minister

has Island
domain: infrastructure
comment: Relazione tra Infrastructure e Island @it
range: island
comment: Relation between Infrastructure and Island
type: ObjectProperty
related match: terminusB

Axiom
annotated target: road
annotated source: has Place
matching quantification: 4

has Boxer
domain: infrastructure
range: boxer
comment: Relazione tra Infrastructure e Boxer @it
comment: Relation between Infrastructure and Boxer
type: ObjectProperty

has Saint
type: ObjectProperty
range: saint
comment: Relazione tra Infrastructure e Saint @it
domain: infrastructure
comment: Relation between Infrastructure and Saint

has Automobile
type: ObjectProperty
domain: infrastructure
comment: Relazione tra Infrastructure e Automobile @it
range: automobile
comment: Relation between Infrastructure and Automobile

has Restaurant
domain: infrastructure
comment: Relazione tra Infrastructure e Restaurant @it
type: ObjectProperty
range: restaurant
comment: Relation between Infrastructure and Restaurant

has Aircraft
comment: Relazione tra Infrastructure e Aircraft @it
domain: infrastructure
comment: Relation between Infrastructure and Aircraft
range: aircraft
type: ObjectProperty

lighthouse
type: Class
label: phare @fr

has Criminal
comment: Relazione tra Infrastructure e Criminal @it
range: criminal
domain: infrastructure
type: ObjectProperty
comment: Relation between Infrastructure and Criminal

aircraft
label: αεροσκάφος @el
type: Class
label: avion @fr

Axiom
annotated source: has Mammal
annotated target: cities
matching quantification: 1

has Senator
comment: Relazione tra Infrastructure e Senator @it
type: ObjectProperty
comment: Relation between Infrastructure and Senator
range: senator
domain: infrastructure

Axiom
matching quantification: 1
annotated target: cities
annotated source: has Airport

Axiom
annotated target: operator
annotated source: has Company
matching quantification: 55

has Lighthouse
domain: infrastructure
comment: Relation between Infrastructure and Lighthouse
range: lighthouse
comment: Relazione tra Infrastructure e Lighthouse @it
type: ObjectProperty

hockey team
type: Class
label: équipe de hockey @fr

soccer player
type: Class
label: joueur de football @fr

has Television Episode
range: television episode
type: ObjectProperty
domain: infrastructure
comment: Relation between Infrastructure and Television Episode
comment: Relazione tra Infrastructure e Television Episode @it

reptile
type: Class

has Astronaut
type: ObjectProperty
comment: Relation between Infrastructure and Astronaut
range: astronaut
comment: Relazione tra Infrastructure e Astronaut @it
domain: infrastructure

has Bird
comment: Relation between Infrastructure and Bird
domain: infrastructure
comment: Relazione tra Infrastructure e Bird @it
type: ObjectProperty
range: bird

legislature
label: pouvoir législatif @fr
type: Class

cave
label: grotte @fr
type: Class

Axiom
annotated source: has River
matching quantification: 3
annotated target: road

Axiom
annotated target: terminusB
annotated source: has Island
matching quantification: 1

airline
label: compagnie aérienne @fr
type: Class

monarch
type: Class
label: monarque @fr

has Monument
comment: Relazione tra Infrastructure e Monument @it
domain: infrastructure
comment: Relation between Infrastructure and Monument
range: monument
type: ObjectProperty

congressman
type: Class
label: membre du Congrès @fr

has College
range: college
comment: Relazione tra Infrastructure e College @it
comment: Relation between Infrastructure and College
type: ObjectProperty
domain: infrastructure

golf player
label: golfeur @fr
type: Class

has American Football Player
domain: infrastructure
range: american football player
type: ObjectProperty
comment: Relazione tra Infrastructure e American Football Player @it
comment: Relation between Infrastructure and American Football Player

nascar driver
type: Class
label: pilote de la nascar @fr

building
label: bâtiment @fr
type: Class
label: κτίριο @el

journalist
type: Class
label: journaliste @fr

space mission
label: mission spatiale @fr
label: διαστημική αποστολή @el
type: Class

Axiom
annotated target: destinations
matching quantification: 1
annotated source: has University

insect
label: insecte @fr
type: Class

film
label: ταινία @el
type: Class

Axiom
annotated source: has Building
matching quantification: 1
annotated target: cities

Axiom
annotated target: terminusA
matching quantification: 1
annotated source: has Historic Place

american football team
label: équipe américaine de football américain @fr
type: Class

has Beverage
type: ObjectProperty
domain: infrastructure
comment: Relazione tra Infrastructure e Beverage @it
range: beverage
comment: Relation between Infrastructure and Beverage

Supreme Court of the United States case
type: Class
label: cas juridique de la Cour suprême des États-Unis @fr

has Comics Character
domain: infrastructure
comment: Relazione tra Infrastructure e Comics Character @it
range: comics character
comment: Relation between Infrastructure and Comics Character
type: ObjectProperty

bird
type: Class
label: oiseau @fr

chemical compound
label: produit chimique @fr
type: Class

Axiom
annotated target: upstream
annotated source: has Power Station
matching quantification: 8

has Wine Region
domain: infrastructure
comment: Relation between Infrastructure and Wine Region
type: ObjectProperty
range: wine region
comment: Relazione tra Infrastructure e Wine Region @it

power station
type: Class

Axiom
annotated target: towns
annotated source: has Place
matching quantification: 12

musical artist
label: musicien @fr
type: Class
label: artista musical @pt

stream
label: ruisseau @fr
type: Class

has Protected Area
comment: Relation between Infrastructure and Protected Area
type: ObjectProperty
range: protected area
domain: infrastructure
comment: Relazione tra Infrastructure e Protected Area @it
related match: terminusB
related match: road

Axiom
annotated source: has Country
annotated target: location
matching quantification: 3

eukaryote
type: Class
label: eucaryote @fr

has Language
type: ObjectProperty
comment: Relazione tra Infrastructure e Language @it
domain: infrastructure
range: language
comment: Relation between Infrastructure and Language

has Broadcast
comment: Relation between Infrastructure and Broadcast
comment: Relazione tra Infrastructure e Broadcast @it
range: broadcast
domain: infrastructure
type: ObjectProperty

Axiom
annotated source: has Body Of Water
matching quantification: 3
annotated target: road

has Election
comment: Relazione tra Infrastructure e Election @it
range: Election
domain: infrastructure
comment: Relation between Infrastructure and Election
type: ObjectProperty

park
type: Class
label: parc @fr

has Supreme Court Of The United States Case
comment: Relazione tra Infrastructure e Supreme Court Of The United States Case @it
comment: Relation between Infrastructure and Supreme Court Of The United States Case
type: ObjectProperty
range: Supreme Court of the United States case
domain: infrastructure

fictional character
type: Class
label: personnage de fiction @fr

has Writer
type: ObjectProperty
comment: Relation between Infrastructure and Writer
range: writer
comment: Relazione tra Infrastructure e Writer @it
domain: infrastructure

rugby player
type: Class
label: joueur de rugby @fr

has Baseball Player
range: baseball player
domain: infrastructure
comment: Relation between Infrastructure and Baseball Player
type: ObjectProperty
comment: Relazione tra Infrastructure e Baseball Player @it

american football league
type: Class

has Military Conflict
range: military conflict
type: ObjectProperty
comment: Relazione tra Infrastructure e Military Conflict @it
comment: Relation between Infrastructure and Military Conflict
domain: infrastructure

Axiom
annotated target: location
annotated source: has Mountain
matching quantification: 2

has Person
range: person
comment: Relation between Infrastructure and Person
type: ObjectProperty
comment: Relazione tra Infrastructure e Person @it
domain: infrastructure

has Wrestler
type: ObjectProperty
comment: Relation between Infrastructure and Wrestler
range: wrestler
comment: Relazione tra Infrastructure e Wrestler @it
domain: infrastructure

has Drug
comment: Relation between Infrastructure and Drug
type: ObjectProperty
domain: infrastructure
range: drug
comment: Relazione tra Infrastructure e Drug @it

Axiom
annotated target: location
matching quantification: 49
annotated source: has Place

actor
label: Schauspieler @de
type: Class
label: acteur @fr

has Stadium
comment: Relazione tra Infrastructure e Stadium @it
type: ObjectProperty
comment: Relation between Infrastructure and Stadium
domain: infrastructure
range: stadium

has Philosopher
comment: Relation between Infrastructure and Philosopher
range: philosopher
domain: infrastructure
comment: Relazione tra Infrastructure e Philosopher @it
type: ObjectProperty

has Historic Building
domain: infrastructure
comment: Relation between Infrastructure and Historic Building
type: ObjectProperty
range: historic building
comment: Relazione tra Infrastructure e Historic Building @it

Axiom
annotated source: has Bridge
annotated target: destinations
matching quantification: 1

place
label: lugar @pt
type: Class
label: lieu @fr
label: περιοχή @el

has Hotel
domain: infrastructure
type: ObjectProperty
comment: Relation between Infrastructure and Hotel
comment: Relazione tra Infrastructure e Hotel @it
range: hotel

Axiom
matching quantification: 1
annotated target: location
annotated source: has Airport

has Software
domain: infrastructure
range: software
comment: Relation between Infrastructure and Software
comment: Relazione tra Infrastructure e Software @it
type: ObjectProperty

Axiom
annotated target: terminusA
matching quantification: 1
annotated source: has University

has Flowering Plant
comment: Relazione tra Infrastructure e Flowering Plant @it
range: flowering plant
domain: infrastructure
comment: Relation between Infrastructure and Flowering Plant
type: ObjectProperty

infrastructure
type: Class

Axiom
matching quantification: 6
annotated target: terminusA
annotated source: has Company

mountain
label: Βουνό @el
label: montagne @fr
type: Class

criminal
label: criminel @fr
type: Class

Axiom
annotated target: location
matching quantification: 1
annotated source: has Building

space shuttle
label: navette spatiale @fr
type: Class

has Building
comment: Relation between Infrastructure and Building
comment: Relazione tra Infrastructure e Building @it
related match: terminusA
related match: destinations
range: building
type: ObjectProperty
related match: junction
related match: terminusB
domain: infrastructure
related match: bridge
related match: location
related match: cities

flowering plant
label: angiospermes @fr
type: Class

has Weapon
type: ObjectProperty
domain: infrastructure
range: weapon
comment: Relazione tra Infrastructure e Weapon @it
comment: Relation between Infrastructure and Weapon

has Valley
type: ObjectProperty
comment: Relation between Infrastructure and Valley
comment: Relazione tra Infrastructure e Valley @it
domain: infrastructure
range: valley

senator
label: sénateur @fr
type: Class

saint
type: Class

has Park
domain: infrastructure
type: ObjectProperty
range: park
comment: Relation between Infrastructure and Park
comment: Relazione tra Infrastructure e Park @it
related match: terminusA

has Album
range: album
comment: Relazione tra Infrastructure e Album @it
domain: infrastructure
type: ObjectProperty
comment: Relation between Infrastructure and Album

Axiom
matching quantification: 1
annotated target: terminusB
annotated source: has Bridge

has Bridge
comment: Relation between Infrastructure and Bridge
type: ObjectProperty
comment: Relazione tra Infrastructure e Bridge @it
related match: terminusA
domain: infrastructure
related match: terminusB
range: bridge
related match: destinations
related match: bridge

valley
label: vallée @fr
type: Class

comedian
label: comédien @fr
type: Class

Axiom
annotated target: countySpecial
matching quantification: 4
annotated source: has Place

song
label: chanson @fr
type: Class

has Planet
range: planet
type: ObjectProperty
comment: Relation between Infrastructure and Planet
domain: infrastructure
comment: Relazione tra Infrastructure e Planet @it

Axiom
annotated target: terminusB
matching quantification: 1
annotated source: has Lake

Axiom
matching quantification: 7
annotated source: has Organisation
annotated target: terminusA

Axiom
annotated target: bridge
annotated source: has Bridge
matching quantification: 6

Playboy Playmate
type: Class
label: playmate pour Playboy @fr

convention
type: Class
label: congrès @fr

book
type: Class
label: livre @fr
label: βιβλίο @el
label: llibre @ca
label: książka @pl

Axiom
annotated target: junction
matching quantification: 2
annotated source: has Building

has Colour
domain: infrastructure
type: ObjectProperty
comment: Relazione tra Infrastructure e Colour @it
range: colour
comment: Relation between Infrastructure and Colour

has Golf League
comment: Relation between Infrastructure and Golf League
domain: infrastructure
comment: Relazione tra Infrastructure e Golf League @it
type: ObjectProperty
range: golf league

shopping mall
label: centre commercial @fr
type: Class

has Amphibian
domain: infrastructure
comment: Relazione tra Infrastructure e Amphibian @it
range: amphibian
type: ObjectProperty
comment: Relation between Infrastructure and Amphibian

Axiom
matching quantification: 2
annotated source: has Airport
annotated target: junction

gridiron football player
type: Class
label: joueur de football américain gridiron @fr

Axiom
annotated source: has Place
matching quantification: 6
annotated target: bridge

Axiom
matching quantification: 117
annotated target: terminusB
annotated source: has Place

has Golf Player
range: golf player
type: ObjectProperty
domain: infrastructure
comment: Relation between Infrastructure and Golf Player
comment: Relazione tra Infrastructure e Golf Player @it

ski area
label: domaine skiable @fr
type: Class

non-profit organisation
label: organisation à but non lucratif @fr
type: Class

has Basketball Team
range: basketball team
comment: Relation between Infrastructure and Basketball Team
comment: Relazione tra Infrastructure e Basketball Team @it
domain: infrastructure
type: ObjectProperty

Axiom
annotated source: has Body Of Water
annotated target: destinations
matching quantification: 3

has Film
comment: Relazione tra Infrastructure e Film @it
range: film
comment: Relation between Infrastructure and Film
type: ObjectProperty
domain: infrastructure

Axiom
annotated source: has World Heritage Site
annotated target: terminusB
matching quantification: 1

has Organisation
related match: owner
comment: Relazione tra Infrastructure e Organisation @it
type: ObjectProperty
range: organisation
domain: infrastructure
related match: destinations
related match: operator
related match: terminusA
comment: Relation between Infrastructure and Organisation

Axiom
annotated target: destinations
matching quantification: 491
annotated source: has Place

has Locomotive
domain: infrastructure
comment: Relation between Infrastructure and Locomotive
range: locomotive
comment: Relazione tra Infrastructure e Locomotive @it
type: ObjectProperty

Axiom
matching quantification: 101
annotated target: counties
annotated source: has Place

has Mountain Range
range: mountain range
type: ObjectProperty
comment: Relation between Infrastructure and Mountain Range
comment: Relazione tra Infrastructure e Mountain Range @it
domain: infrastructure

mollusca
type: Class
label: mollusque @fr

software
type: Class
label: logiciel @fr

has Body Of Water
comment: Relation between Infrastructure and Body Of Water
related match: terminusB
domain: infrastructure
type: ObjectProperty
comment: Relazione tra Infrastructure e Body Of Water @it
related match: river
related match: road
range: body of water
related match: destinations

Axiom
matching quantification: 11
annotated target: destinations
annotated source: has Building

artist
label: artiste @fr
type: Class
label: Künstler @de

has Award
comment: Relation between Infrastructure and Award
comment: Relazione tra Infrastructure e Award @it
range: award
domain: infrastructure
type: ObjectProperty

wine region
type: Class
label: région viticole @fr

Axiom
matching quantification: 1
annotated target: terminusB
annotated source: has Airport

weapon
type: Class
label: arme @fr

has Race
comment: Relation between Infrastructure and Race
range: race
domain: infrastructure
comment: Relazione tra Infrastructure e Race @it
type: ObjectProperty

company
type: Class
label: entreprise @fr

Axiom
annotated target: after
annotated source: has Power Station
matching quantification: 12

has Governor
comment: Relazione tra Infrastructure e Governor @it
range: governor
domain: infrastructure
comment: Relation between Infrastructure and Governor
type: ObjectProperty

drug
type: Class
label: médicament @fr

has Song
comment: Relazione tra Infrastructure e Song @it
domain: infrastructure
type: ObjectProperty
comment: Relation between Infrastructure and Song
range: song

has Plant
domain: infrastructure
type: ObjectProperty
comment: Relation between Infrastructure and Plant
comment: Relazione tra Infrastructure e Plant @it
range: plant

has Lake
range: lake
type: ObjectProperty
comment: Relazione tra Infrastructure e Lake @it
domain: infrastructure
comment: Relation between Infrastructure and Lake
related match: terminusB
related match: destinations

magazine
type: Class
label: περιοδικό @el

has Website
range: website
comment: Relazione tra Infrastructure e Website @it
domain: infrastructure
comment: Relation between Infrastructure and Website
type: ObjectProperty

Axiom
annotated source: has Place
matching quantification: 1
annotated target: http://dbpedia.org/property/n

Axiom
annotated target: terminusB
matching quantification: 1
annotated source: has Body Of Water

canal
type: Class

has Music Genre
domain: infrastructure
comment: Relation between Infrastructure and Music Genre
comment: Relazione tra Infrastructure e Music Genre @it
type: ObjectProperty
range: music genre

military person
type: Class
label: militaire @fr

has Military Unit
domain: infrastructure
comment: Relazione tra Infrastructure e Military Unit @it
type: ObjectProperty
comment: Relation between Infrastructure and Military Unit
range: military unit

has Currency
comment: Relazione tra Infrastructure e Currency @it
domain: infrastructure
range: currency
type: ObjectProperty
comment: Relation between Infrastructure and Currency

philosopher
type: Class
label: philosophe @fr

award
label: récompense @fr
type: Class

locomotive
type: Class

Axiom
matching quantification: 6
annotated target: bridge
annotated source: has Building

has World Heritage Site
comment: Relazione tra Infrastructure e World Heritage Site @it
domain: infrastructure
range: World Heritage Site
type: ObjectProperty
comment: Relation between Infrastructure and World Heritage Site
related match: terminusB

Axiom
matching quantification: 117
annotated target: cities
annotated source: has Place

college
type: Class

anatomical structure
label: structure anatomique @fr
type: Class

sport
type: Class

has Magazine
range: magazine
domain: infrastructure
type: ObjectProperty
comment: Relation between Infrastructure and Magazine
comment: Relazione tra Infrastructure e Magazine @it

has Baseball League
comment: Relazione tra Infrastructure e Baseball League @it
domain: infrastructure
type: ObjectProperty
range: baseball league
comment: Relation between Infrastructure and Baseball League

restaurant
type: Class

cricketer
type: Class
label: joueur de cricket @fr

single
type: Class

Axiom
annotated source: has Place
matching quantification: 4
annotated target: regions

Axiom
matching quantification: 1
annotated target: fuelType
annotated source: has Chemical Compound

Band
label: banda @pt
label: Musikgruppe @de
type: Class
label: groupe de musique @fr

Axiom
annotated target: terminusA
annotated source: has Building
matching quantification: 1

Axiom
annotated target: river
annotated source: has Body Of Water
matching quantification: 1

university
label: πανεπιστήμιο @el
label: université @fr
type: Class

ethnic group
label: groupe ethnique @fr
type: Class

has Newspaper
range: newspaper
comment: Relazione tra Infrastructure e Newspaper @it
domain: infrastructure
comment: Relation between Infrastructure and Newspaper
type: ObjectProperty

has Playboy Playmate
type: ObjectProperty
comment: Relazione tra Infrastructure e Playboy Playmate @it
domain: infrastructure
comment: Relation between Infrastructure and Playboy Playmate
range: Playboy Playmate

Axiom
annotated target: provinces
matching quantification: 2
annotated source: has Place

has Ski Area
comment: Relazione tra Infrastructure e Ski Area @it
domain: infrastructure
comment: Relation between Infrastructure and Ski Area
range: ski area
type: ObjectProperty

hotel
type: Class
label: hôtel @fr

music festival
type: Class
label: festival de musique @fr

politician
label: politicien @fr
type: Class

college coach
type: Class
label: entraîneur universitaire @fr

television episode
type: Class
label: épisode télévisé @fr

ice hockey league
label: ligue d'hockey sur glace @fr
type: Class

has Disease
range: disease
domain: infrastructure
comment: Relazione tra Infrastructure e Disease @it
type: ObjectProperty
comment: Relation between Infrastructure and Disease

Axiom
annotated source: has Lake
annotated target: destinations
matching quantification: 3

has Soccer Manager
range: soccer manager
comment: Relation between Infrastructure and Soccer Manager
comment: Relazione tra Infrastructure e Soccer Manager @it
domain: infrastructure
type: ObjectProperty

soccer club
label: club de football @fr
type: Class

Axiom
annotated target: destinations
matching quantification: 1
annotated source: has Organisation

Axiom
matching quantification: 8
annotated source: has Place
annotated target: locationSpecial

has Trade Union
comment: Relation between Infrastructure and Trade Union
domain: infrastructure
range: trade union
type: ObjectProperty
comment: Relazione tra Infrastructure e Trade Union @it

historic building
label: bâtiment historique @fr
type: Class

office holder
type: Class
label: Amtsinhaber @de
label: titulaire @fr

baseball player
type: Class
label: joueur de baseball @fr

has Nascar Driver
type: ObjectProperty
comment: Relation between Infrastructure and Nascar Driver
range: nascar driver
domain: infrastructure
comment: Relazione tra Infrastructure e Nascar Driver @it

has Olympics
comment: Relazione tra Infrastructure e Olympics @it
comment: Relation between Infrastructure and Olympics
range: olympics
type: ObjectProperty
domain: infrastructure

military conflict
label: conflit militaire @fr
type: Class

website
label: site web @fr
label: Ιστότοπος @el
type: Class

Axiom
annotated target: downstream
matching quantification: 8
annotated source: has Power Station

has Non- Profit Organisation
range: non-profit organisation
comment: Relation between Infrastructure and Non- Profit Organisation
type: ObjectProperty
comment: Relazione tra Infrastructure e Non- Profit Organisation @it
domain: infrastructure

has Space Shuttle
range: space shuttle
type: ObjectProperty
comment: Relazione tra Infrastructure e Space Shuttle @it
domain: infrastructure
comment: Relation between Infrastructure and Space Shuttle

has Record Label
type: ObjectProperty
comment: Relazione tra Infrastructure e Record Label @it
range: record label
comment: Relation between Infrastructure and Record Label
domain: infrastructure

Axiom
annotated source: has Protected Area
matching quantification: 1
annotated target: terminusB

ice hockey player
type: Class
label: joueur de hockey sur glace @fr

Christian Bishop
type: Class
label: évêque chrétien @fr

mountain range
label: chaîne de montagne @fr
type: Class

Axiom
matching quantification: 1
annotated source: has Park
annotated target: terminusA

beverage
label: boisson @fr
type: Class

Axiom
matching quantification: 59
annotated target: junction
annotated source: has Place

has President
domain: infrastructure
range: president
comment: Relation between Infrastructure and President
type: ObjectProperty
comment: Relazione tra Infrastructure e President @it

has Fish
type: ObjectProperty
range: fish
comment: Relation between Infrastructure and Fish
comment: Relazione tra Infrastructure e Fish @it
domain: infrastructure

has Historic Place
range: historic place
comment: Relazione tra Infrastructure e Historic Place @it
comment: Relation between Infrastructure and Historic Place
domain: infrastructure
type: ObjectProperty
related match: terminusA

planet
label: planète @fr
type: Class

has Gridiron Football Player
comment: Relazione tra Infrastructure e Gridiron Football Player @it
domain: infrastructure
comment: Relation between Infrastructure and Gridiron Football Player
range: gridiron football player
type: ObjectProperty

Axiom
annotated target: owner
matching quantification: 26
annotated source: has Organisation

has Ice Hockey League
comment: Relation between Infrastructure and Ice Hockey League
comment: Relazione tra Infrastructure e Ice Hockey League @it
domain: infrastructure
range: ice hockey league
type: ObjectProperty

scientist
label: Wissenschaftler @de
type: Class
label: scientifique @fr

has Hockey Team
range: hockey team
comment: Relazione tra Infrastructure e Hockey Team @it
comment: Relation between Infrastructure and Hockey Team
type: ObjectProperty
domain: infrastructure

has Stream
related match: river
related match: road
type: ObjectProperty
comment: Relazione tra Infrastructure e Stream @it
range: stream
comment: Relation between Infrastructure and Stream
domain: infrastructure

golf league
label: ligue de golf @fr
type: Class

Axiom
annotated source: has Stream
annotated target: road
matching quantification: 3

Axiom
annotated source: has Bridge
annotated target: terminusA
matching quantification: 1

olympics
label: Jeux Olympiques @fr
type: Class

organisation
label: Organisation @de
type: Class
label: organização @pt

baseball league
type: Class
label: ligue de baseball @fr

bridge
type: Class
label: pont @fr

has Artist
range: artist
comment: Relazione tra Infrastructure e Artist @it
domain: infrastructure
type: ObjectProperty
comment: Relation between Infrastructure and Artist

Axiom
matching quantification: 1
annotated source: has Place
annotated target: maint

has Rocket
domain: infrastructure
comment: Relation between Infrastructure and Rocket
comment: Relazione tra Infrastructure e Rocket @it
type: ObjectProperty
range: rocket

has Office Holder
type: ObjectProperty
range: office holder
domain: infrastructure
comment: Relazione tra Infrastructure e Office Holder @it
comment: Relation between Infrastructure and Office Holder

has Sport
type: ObjectProperty
comment: Relazione tra Infrastructure e Sport @it
range: sport
comment: Relation between Infrastructure and Sport
domain: infrastructure

plant
label: plante @fr
type: Class

broadcast
type: Class
label: Émission de télévision @fr

has American Football Team
type: ObjectProperty
range: american football team
comment: Relazione tra Infrastructure e American Football Team @it
domain: infrastructure
comment: Relation between Infrastructure and American Football Team

has Ship
comment: Relation between Infrastructure and Ship
type: ObjectProperty
range: ship
domain: infrastructure
comment: Relazione tra Infrastructure e Ship @it

mammal
type: Class
label: mammifère @fr

Axiom
annotated source: has Organisation
matching quantification: 55
annotated target: operator

Axiom
matching quantification: 1
annotated target: beltwayCity
annotated source: has Place

island
type: Class
label: νησί @el
label: île @fr

has Mammal
related match: cities
range: mammal
type: ObjectProperty
comment: Relazione tra Infrastructure e Mammal @it
domain: infrastructure
comment: Relation between Infrastructure and Mammal

has Anatomical Structure
range: anatomical structure
comment: Relazione tra Infrastructure e Anatomical Structure @it
comment: Relation between Infrastructure and Anatomical Structure
type: ObjectProperty
domain: infrastructure

has Scientist
domain: infrastructure
comment: Relazione tra Infrastructure e Scientist @it
range: scientist
type: ObjectProperty
comment: Relation between Infrastructure and Scientist

comics character
type: Class
label: personnage de bandes dessinées @fr

skyscraper
type: Class
label: gratte-ciel @fr

Axiom
annotated target: river
matching quantification: 1
annotated source: has Place

radio station
label: station de radio @fr
type: Class

has Insect
comment: Relazione tra Infrastructure e Insect @it
range: insect
domain: infrastructure
comment: Relation between Infrastructure and Insect
type: ObjectProperty

has Power Station
related match: after
related match: upstream
related match: downstream
comment: Relazione tra Infrastructure e Power Station @it
comment: Relation between Infrastructure and Power Station
type: ObjectProperty
domain: infrastructure
range: power station

member of parliament
type: Class
label: membre du Parlement @fr

has Judge
domain: infrastructure
range: judge
comment: Relation between Infrastructure and Judge
comment: Relazione tra Infrastructure e Judge @it
type: ObjectProperty

has Mayor
range: mayor
domain: infrastructure
comment: Relazione tra Infrastructure e Mayor @it
type: ObjectProperty
comment: Relation between Infrastructure and Mayor

has Space Mission
domain: infrastructure
comment: Relation between Infrastructure and Space Mission
range: space mission
comment: Relazione tra Infrastructure e Space Mission @it
type: ObjectProperty

Axiom
annotated source: has Place
annotated target: terminusA
matching quantification: 120

conifer
type: Class
label: conifères @fr

airport
type: Class
label: Flughafen @de
label: aéroport @fr