has Historic Building
domain: journalist
type: ObjectProperty
comment: Relazione tra Journalist e Historic Building @it
comment: Relation between Journalist and Historic Building
range: historic building

rocket
label: fusée @fr
type: Class

has Single
domain: journalist
comment: Relazione tra Journalist e Single @it
type: ObjectProperty
range: single
comment: Relation between Journalist and Single

has Bridge
domain: journalist
range: bridge
type: ObjectProperty
comment: Relation between Journalist and Bridge
comment: Relazione tra Journalist e Bridge @it

has Space Shuttle
comment: Relation between Journalist and Space Shuttle
domain: journalist
comment: Relazione tra Journalist e Space Shuttle @it
type: ObjectProperty
range: space shuttle

has Figure Skater
comment: Relation between Journalist and Figure Skater
type: ObjectProperty
range: figure skater
domain: journalist
comment: Relazione tra Journalist e Figure Skater @it

colour
label: χρώμα @el
label: couleur @fr
type: Class

automobile
type: Class

Axiom
matching quantification: 1
annotated target: after
annotated source: has College Coach

Election
type: Class
label: élection @fr

american football player
label: joueur de football américain @fr
type: Class

has Shopping Mall
comment: Relation between Journalist and Shopping Mall
comment: Relazione tra Journalist e Shopping Mall @it
range: shopping mall
domain: journalist
type: ObjectProperty

stadium
type: Class
label: stade @fr

has Inline Hockey League
type: ObjectProperty
range: inline hockey league
domain: journalist
comment: Relazione tra Journalist e Inline Hockey League @it
comment: Relation between Journalist and Inline Hockey League

soccer league
type: Class
label: ligue de football @fr

astronaut
label: astronaute @fr
label: Astronaut @de
type: Class

has British Royalty
comment: Relation between Journalist and British Royalty
domain: journalist
comment: Relazione tra Journalist e British Royalty @it
type: ObjectProperty
range: British royalty

has Election
comment: Relazione tra Journalist e Election @it
type: ObjectProperty
comment: Relation between Journalist and Election
range: Election
domain: journalist

has Cricketer
domain: journalist
type: ObjectProperty
comment: Relation between Journalist and Cricketer
comment: Relazione tra Journalist e Cricketer @it
range: cricketer

has Boxer
type: ObjectProperty
comment: Relation between Journalist and Boxer
domain: journalist
comment: Relazione tra Journalist e Boxer @it
range: boxer

wrestler
type: Class
label: lutteur @fr

has Comics Creator
domain: journalist
range: comics creator
comment: Relazione tra Journalist e Comics Creator @it
type: ObjectProperty
comment: Relation between Journalist and Comics Creator

mayor
label: maire @fr
type: Class

pope
type: Class
label: pape @fr

has Member Of Parliament
related match: relatives
related match: spouse
comment: Relation between Journalist and Member Of Parliament
domain: journalist
type: ObjectProperty
comment: Relazione tra Journalist e Member Of Parliament @it
range: member of parliament

Axiom
annotated source: has Musical Artist
matching quantification: 1
annotated target: after

has Hockey Team
range: hockey team
domain: journalist
comment: Relazione tra Journalist e Hockey Team @it
type: ObjectProperty
comment: Relation between Journalist and Hockey Team

has Model
comment: Relazione tra Journalist e Model @it
type: ObjectProperty
domain: journalist
comment: Relation between Journalist and Model
range: model

Axiom
annotated target: birthPlace
matching quantification: 1
annotated source: has Village

has Insect
comment: Relazione tra Journalist e Insect @it
comment: Relation between Journalist and Insect
domain: journalist
type: ObjectProperty
range: insect

has Book
comment: Relation between Journalist and Book
range: book
comment: Relazione tra Journalist e Book @it
domain: journalist
type: ObjectProperty

protected area
type: Class
label: προστατευμένη περιοχή @el
label: aire protégée @fr

road
label: route @fr
type: Class

has College
type: ObjectProperty
comment: Relazione tra Journalist e College @it
range: college
domain: journalist
comment: Relation between Journalist and College

has Congressman
range: congressman
type: ObjectProperty
comment: Relazione tra Journalist e Congressman @it
comment: Relation between Journalist and Congressman
domain: journalist

boxer
label: boxeur @fr
type: Class

has Station
domain: journalist
comment: Relation between Journalist and Station
comment: Relazione tra Journalist e Station @it
range: station
type: ObjectProperty

judge
type: Class
label: juge @fr

World Heritage Site
type: Class
label: site du patrimoine mondial @fr

has Television Episode
comment: Relazione tra Journalist e Television Episode @it
comment: Relation between Journalist and Television Episode
type: ObjectProperty
domain: journalist
range: television episode

has Poker Player
domain: journalist
comment: Relazione tra Journalist e Poker Player @it
comment: Relation between Journalist and Poker Player
type: ObjectProperty
range: poker player

has Video Game
domain: journalist
type: ObjectProperty
comment: Relazione tra Journalist e Video Game @it
comment: Relation between Journalist and Video Game
range: video game

has Record Label
domain: journalist
comment: Relation between Journalist and Record Label
comment: Relazione tra Journalist e Record Label @it
type: ObjectProperty
range: record label

station
type: Class

language
type: Class
label: langage @fr

has Continent
comment: Relation between Journalist and Continent
comment: Relazione tra Journalist e Continent @it
domain: journalist
type: ObjectProperty
range: continent

has Architect
comment: Relation between Journalist and Architect
range: architect
comment: Relazione tra Journalist e Architect @it
type: ObjectProperty
domain: journalist

lake
type: Class
label: lac @fr

Axiom
matching quantification: 1
annotated target: relatives
annotated source: has Member Of Parliament

arachnid
label: arachnides @fr
type: Class

Axiom
annotated source: has American Football Player
matching quantification: 1
annotated target: years

has Soccer League
comment: Relazione tra Journalist e Soccer League @it
comment: Relation between Journalist and Soccer League
domain: journalist
type: ObjectProperty
range: soccer league

has Ice Hockey League
comment: Relazione tra Journalist e Ice Hockey League @it
range: ice hockey league
comment: Relation between Journalist and Ice Hockey League
type: ObjectProperty
domain: journalist

has Military Unit
domain: journalist
comment: Relazione tra Journalist e Military Unit @it
range: military unit
type: ObjectProperty
comment: Relation between Journalist and Military Unit

governor
label: gouverneur @fr
type: Class

has Sport
comment: Relation between Journalist and Sport
type: ObjectProperty
range: sport
comment: Relazione tra Journalist e Sport @it
domain: journalist

poker player
type: Class
label: joueur de poker @fr

river
type: Class
label: rivière @fr

has Soccer Manager
range: soccer manager
domain: journalist
comment: Relation between Journalist and Soccer Manager
comment: Relazione tra Journalist e Soccer Manager @it
type: ObjectProperty

has National Collegiate Athletic Association Athlete
comment: Relazione tra Journalist e National Collegiate Athletic Association Athlete @it
type: ObjectProperty
comment: Relation between Journalist and National Collegiate Athletic Association Athlete
domain: journalist
range: national collegiate athletic association athlete

ship
label: navire @fr
type: Class

museum
label: musée @fr
type: Class

fish
label: poisson @fr
type: Class

tennis player
label: joueur de tennis @fr
type: Class

has Golf Player
comment: Relation between Journalist and Golf Player
type: ObjectProperty
range: golf player
domain: journalist
comment: Relazione tra Journalist e Golf Player @it

has Village
related match: birthPlace
type: ObjectProperty
range: village
domain: journalist
comment: Relation between Journalist and Village
comment: Relazione tra Journalist e Village @it

video game
label: jeux vidéo @fr
type: Class

trade union
type: Class
label: syndicat professionnel @fr

has Airline
comment: Relation between Journalist and Airline
domain: journalist
range: airline
comment: Relazione tra Journalist e Airline @it
type: ObjectProperty

currency
label: devise @fr
type: Class

prime minister
type: Class
label: premier ministre @fr

British royalty
label: royauté Britannique @fr
type: Class

has Lake
range: lake
domain: journalist
comment: Relation between Journalist and Lake
comment: Relazione tra Journalist e Lake @it
type: ObjectProperty

race
label: course @fr
type: Class

historic place
type: Class
label: site historique @fr

hospital
label: hôpital @fr
type: Class

lunar crater
type: Class
label: cratère lunaire @fr

Axiom
annotated target: after
annotated source: has American Football Player
matching quantification: 1

continent
type: Class
label: ήπειρος @el

has Stadium
domain: journalist
range: stadium
comment: Relazione tra Journalist e Stadium @it
comment: Relation between Journalist and Stadium
type: ObjectProperty

has American Football Team
comment: Relation between Journalist and American Football Team
range: american football team
domain: journalist
type: ObjectProperty
comment: Relazione tra Journalist e American Football Team @it

album
type: Class
label: Album @de

has Olympics
comment: Relazione tra Journalist e Olympics @it
comment: Relation between Journalist and Olympics
range: olympics
domain: journalist
type: ObjectProperty

figure skater
label: patineur artistique @fr
type: Class

has Basketball Player
comment: Relation between Journalist and Basketball Player
type: ObjectProperty
range: basketball player
comment: Relazione tra Journalist e Basketball Player @it
domain: journalist

has Band
comment: Relazione tra Journalist e Band @it
range: Band
domain: journalist
type: ObjectProperty
comment: Relation between Journalist and Band

military unit
type: Class
label: unité militaire @fr

has Town
comment: Relazione tra Journalist e Town @it
type: ObjectProperty
range: town
domain: journalist
comment: Relation between Journalist and Town

soccer manager
label: entraîneur de football @fr
type: Class

basketball team
type: Class

music genre
type: Class
label: género musical @pt
label: genre musical @fr

has Song
domain: journalist
comment: Relazione tra Journalist e Song @it
range: song
comment: Relation between Journalist and Song
type: ObjectProperty

has Arachnid
comment: Relation between Journalist and Arachnid
type: ObjectProperty
domain: journalist
range: arachnid
comment: Relazione tra Journalist e Arachnid @it

has Judge
range: judge
comment: Relazione tra Journalist e Judge @it
type: ObjectProperty
comment: Relation between Journalist and Judge
domain: journalist

record label
label: label discographique @fr
type: Class

architect
type: Class
label: architecte @fr

model
label: mannequin @fr
type: Class

ambassador
label: ambassadeur @fr
type: Class

has Scientist
comment: Relazione tra Journalist e Scientist @it
comment: Relation between Journalist and Scientist
domain: journalist
type: ObjectProperty
range: scientist

has Astronaut
comment: Relation between Journalist and Astronaut
domain: journalist
range: astronaut
comment: Relazione tra Journalist e Astronaut @it
type: ObjectProperty
related match: years

film festival
type: Class
label: festival du film @fr

has Space Station
comment: Relation between Journalist and Space Station
type: ObjectProperty
domain: journalist
comment: Relazione tra Journalist e Space Station @it
range: space station

has Non- Profit Organisation
type: ObjectProperty
range: non-profit organisation
domain: journalist
comment: Relazione tra Journalist e Non- Profit Organisation @it
comment: Relation between Journalist and Non- Profit Organisation

has Golf League
type: ObjectProperty
comment: Relazione tra Journalist e Golf League @it
domain: journalist
range: golf league
comment: Relation between Journalist and Golf League

Grand Prix
label: grand prix @fr
type: Class

has Tennis Player
domain: journalist
range: tennis player
comment: Relazione tra Journalist e Tennis Player @it
comment: Relation between Journalist and Tennis Player
type: ObjectProperty

chancellor
label: chancelier @fr
type: Class

comics creator
label: créateur de bandes dessinées @fr
type: Class

aircraft
label: avion @fr
type: Class
label: αεροσκάφος @el

has Museum
domain: journalist
range: museum
comment: Relazione tra Journalist e Museum @it
comment: Relation between Journalist and Museum
type: ObjectProperty

hockey team
type: Class
label: équipe de hockey @fr

soccer player
label: joueur de football @fr
type: Class

has Aircraft
comment: Relazione tra Journalist e Aircraft @it
range: aircraft
domain: journalist
comment: Relation between Journalist and Aircraft
type: ObjectProperty

reptile
type: Class

has Space Mission
type: ObjectProperty
comment: Relation between Journalist and Space Mission
comment: Relazione tra Journalist e Space Mission @it
range: space mission
domain: journalist

legislature
label: pouvoir législatif @fr
type: Class

has Historic Place
type: ObjectProperty
comment: Relation between Journalist and Historic Place
comment: Relazione tra Journalist e Historic Place @it
domain: journalist
range: historic place

airline
label: compagnie aérienne @fr
type: Class

monarch
label: monarque @fr
type: Class

has College Coach
related match: after
comment: Relazione tra Journalist e College Coach @it
comment: Relation between Journalist and College Coach
type: ObjectProperty
range: college coach
domain: journalist

congressman
label: membre du Congrès @fr
type: Class

golf player
label: golfeur @fr
type: Class

has Mixed Martial Arts Event
comment: Relation between Journalist and Mixed Martial Arts Event
range: mixed martial arts event
comment: Relazione tra Journalist e Mixed Martial Arts Event @it
domain: journalist
type: ObjectProperty

has Mayor
range: mayor
type: ObjectProperty
comment: Relazione tra Journalist e Mayor @it
domain: journalist
comment: Relation between Journalist and Mayor

has Grand Prix
comment: Relation between Journalist and Grand Prix
comment: Relazione tra Journalist e Grand Prix @it
range: Grand Prix
domain: journalist
type: ObjectProperty

has Language
range: language
comment: Relation between Journalist and Language
type: ObjectProperty
domain: journalist
comment: Relazione tra Journalist e Language @it

nascar driver
type: Class
label: pilote de la nascar @fr

space mission
type: Class
label: διαστημική αποστολή @el
label: mission spatiale @fr

journalist
type: Class
label: journaliste @fr

has River
comment: Relation between Journalist and River
range: river
domain: journalist
type: ObjectProperty
comment: Relazione tra Journalist e River @it

insect
label: insecte @fr
type: Class

film
label: ταινία @el
type: Class

american football team
type: Class
label: équipe américaine de football américain @fr

Supreme Court of the United States case
type: Class
label: cas juridique de la Cour suprême des États-Unis @fr

has Ski Area
type: ObjectProperty
range: ski area
comment: Relazione tra Journalist e Ski Area @it
domain: journalist
comment: Relation between Journalist and Ski Area

chemical compound
type: Class
label: produit chimique @fr

has Road
comment: Relazione tra Journalist e Road @it
domain: journalist
range: road
type: ObjectProperty
comment: Relation between Journalist and Road

has Reptile
domain: journalist
range: reptile
type: ObjectProperty
comment: Relazione tra Journalist e Reptile @it
comment: Relation between Journalist and Reptile

has Military Person
comment: Relazione tra Journalist e Military Person @it
type: ObjectProperty
range: military person
comment: Relation between Journalist and Military Person
domain: journalist

has Chemical Compound
comment: Relation between Journalist and Chemical Compound
range: chemical compound
domain: journalist
type: ObjectProperty
comment: Relazione tra Journalist e Chemical Compound @it

musical artist
label: musicien @fr
type: Class
label: artista musical @pt

has Flowering Plant
comment: Relation between Journalist and Flowering Plant
range: flowering plant
domain: journalist
type: ObjectProperty
comment: Relazione tra Journalist e Flowering Plant @it

has Musical
comment: Relation between Journalist and Musical
domain: journalist
range: musical
comment: Relazione tra Journalist e Musical @it
type: ObjectProperty

park
label: parc @fr
type: Class

cardinal
type: Class

rugby player
label: joueur de rugby @fr
type: Class

has Basketball Team
domain: journalist
range: basketball team
type: ObjectProperty
comment: Relazione tra Journalist e Basketball Team @it
comment: Relation between Journalist and Basketball Team

american football league
type: Class

has Comics Character
comment: Relazione tra Journalist e Comics Character @it
type: ObjectProperty
comment: Relation between Journalist and Comics Character
range: comics character
domain: journalist

musical
label: musique @fr
type: Class

has American Football Player
type: ObjectProperty
domain: journalist
comment: Relazione tra Journalist e American Football Player @it
comment: Relation between Journalist and American Football Player
range: american football player
related match: years
related match: after
related match: before

has Criminal
comment: Relazione tra Journalist e Criminal @it
range: criminal
type: ObjectProperty
domain: journalist
comment: Relation between Journalist and Criminal

has Music Festival
type: ObjectProperty
comment: Relazione tra Journalist e Music Festival @it
comment: Relation between Journalist and Music Festival
range: music festival
domain: journalist

cyclist
label: cycliste @fr
type: Class

has Prime Minister
range: prime minister
domain: journalist
comment: Relazione tra Journalist e Prime Minister @it
type: ObjectProperty
comment: Relation between Journalist and Prime Minister

has Supreme Court Of The United States Case
domain: journalist
range: Supreme Court of the United States case
type: ObjectProperty
comment: Relation between Journalist and Supreme Court Of The United States Case
comment: Relazione tra Journalist e Supreme Court Of The United States Case @it

has Ice Hockey Player
type: ObjectProperty
comment: Relazione tra Journalist e Ice Hockey Player @it
range: ice hockey player
domain: journalist
comment: Relation between Journalist and Ice Hockey Player

national collegiate athletic association athlete
label: athlète de la national collegiate athletic association @fr
type: Class

Ontology
has author: Aldo Gangemi
comment: Journalist Encyclopedic Knowledge Pattern
extracted from: dbpedia.org
has author: Andrea Giovanni Nuzzolese
has author: Valentina Presutti
has intent: To represent the encyclopedic knowledge expressed by an object typed as Journalist
extracted from: en.wikipedia.org
imports: cpannotationschema.owl

has Baseball Player
comment: Relation between Journalist and Baseball Player
comment: Relazione tra Journalist e Baseball Player @it
domain: journalist
type: ObjectProperty
range: baseball player

has Comedian
range: comedian
comment: Relazione tra Journalist e Comedian @it
domain: journalist
type: ObjectProperty
comment: Relation between Journalist and Comedian

has Monarch
range: monarch
type: ObjectProperty
comment: Relation between Journalist and Monarch
comment: Relazione tra Journalist e Monarch @it
domain: journalist

has Nascar Driver
type: ObjectProperty
comment: Relazione tra Journalist e Nascar Driver @it
comment: Relation between Journalist and Nascar Driver
range: nascar driver
domain: journalist

has Drug
comment: Relazione tra Journalist e Drug @it
type: ObjectProperty
comment: Relation between Journalist and Drug
range: drug
domain: journalist

has Soccer Club
comment: Relation between Journalist and Soccer Club
type: ObjectProperty
range: soccer club
comment: Relazione tra Journalist e Soccer Club @it
domain: journalist

basketball league
type: Class
label: ligue de basketball @fr

mountain
label: Βουνό @el
label: montagne @fr
type: Class

criminal
type: Class
label: criminel @fr

space shuttle
type: Class
label: navette spatiale @fr

flowering plant
type: Class
label: angiospermes @fr

has Saint
type: ObjectProperty
comment: Relazione tra Journalist e Saint @it
range: saint
domain: journalist
comment: Relation between Journalist and Saint

senator
type: Class
label: sénateur @fr

has Fish
range: fish
domain: journalist
comment: Relation between Journalist and Fish
comment: Relazione tra Journalist e Fish @it
type: ObjectProperty

saint
type: Class

has Baseball League
type: ObjectProperty
domain: journalist
comment: Relation between Journalist and Baseball League
comment: Relazione tra Journalist e Baseball League @it
range: baseball league

comedian
label: comédien @fr
type: Class

song
type: Class
label: chanson @fr

has Restaurant
type: ObjectProperty
comment: Relazione tra Journalist e Restaurant @it
range: restaurant
domain: journalist
comment: Relation between Journalist and Restaurant

Axiom
annotated source: has Astronaut
annotated target: years
matching quantification: 1

convention
label: congrès @fr
type: Class

book
label: książka @pl
label: llibre @ca
label: βιβλίο @el
label: livre @fr
type: Class

has Film Festival
range: film festival
type: ObjectProperty
domain: journalist
comment: Relation between Journalist and Film Festival
comment: Relazione tra Journalist e Film Festival @it

shopping mall
type: Class
label: centre commercial @fr

has Ambassador
type: ObjectProperty
comment: Relazione tra Journalist e Ambassador @it
domain: journalist
comment: Relation between Journalist and Ambassador
range: ambassador

bacteria
type: Class
label: bactérie @fr

ski area
label: domaine skiable @fr
type: Class

non-profit organisation
type: Class
label: organisation à but non lucratif @fr

space station
type: Class
label: station spatiale @fr

has Legislature
type: ObjectProperty
domain: journalist
comment: Relazione tra Journalist e Legislature @it
comment: Relation between Journalist and Legislature
range: legislature

canadian football league
type: Class

weapon
type: Class
label: arme @fr

Axiom
annotated target: spouse
annotated source: has Member Of Parliament
matching quantification: 1

has Website
comment: Relazione tra Journalist e Website @it
type: ObjectProperty
domain: journalist
comment: Relation between Journalist and Website
range: website

drug
label: médicament @fr
type: Class

has Race
range: race
comment: Relation between Journalist and Race
comment: Relazione tra Journalist e Race @it
type: ObjectProperty
domain: journalist

has Rugby Player
type: ObjectProperty
comment: Relazione tra Journalist e Rugby Player @it
domain: journalist
comment: Relation between Journalist and Rugby Player
range: rugby player

has Senator
type: ObjectProperty
range: senator
domain: journalist
comment: Relazione tra Journalist e Senator @it
comment: Relation between Journalist and Senator

has Soccer Player
domain: journalist
comment: Relation between Journalist and Soccer Player
type: ObjectProperty
range: soccer player
comment: Relazione tra Journalist e Soccer Player @it

canal
type: Class

has Ship
comment: Relation between Journalist and Ship
comment: Relazione tra Journalist e Ship @it
domain: journalist
type: ObjectProperty
range: ship

military person
label: militaire @fr
type: Class

philosopher
type: Class
label: philosophe @fr

has Colour
domain: journalist
range: colour
comment: Relation between Journalist and Colour
type: ObjectProperty
comment: Relazione tra Journalist e Colour @it

college
type: Class

sport
type: Class

has Hotel
domain: journalist
comment: Relazione tra Journalist e Hotel @it
comment: Relation between Journalist and Hotel
type: ObjectProperty
range: hotel

restaurant
type: Class

cricketer
label: joueur de cricket @fr
type: Class

single
type: Class

Axiom
annotated source: has American Football Player
matching quantification: 1
annotated target: before

mixed martial arts event
label: évènement d'arts martiaux mixtes @fr
type: Class

Band
label: banda @pt
label: Musikgruppe @de
type: Class
label: groupe de musique @fr

town
type: Class
label: ville @fr

has Hospital
range: hospital
comment: Relazione tra Journalist e Hospital @it
domain: journalist
type: ObjectProperty
comment: Relation between Journalist and Hospital

has American Football League
comment: Relazione tra Journalist e American Football League @it
range: american football league
comment: Relation between Journalist and American Football League
type: ObjectProperty
domain: journalist

has Protected Area
comment: Relazione tra Journalist e Protected Area @it
range: protected area
comment: Relation between Journalist and Protected Area
domain: journalist
type: ObjectProperty

hotel
label: hôtel @fr
type: Class

music festival
type: Class
label: festival de musique @fr

has Automobile
comment: Relation between Journalist and Automobile
range: automobile
comment: Relazione tra Journalist e Automobile @it
domain: journalist
type: ObjectProperty

college coach
label: entraîneur universitaire @fr
type: Class

television episode
label: épisode télévisé @fr
type: Class

has Mountain Range
comment: Relazione tra Journalist e Mountain Range @it
type: ObjectProperty
range: mountain range
comment: Relation between Journalist and Mountain Range
domain: journalist

village
type: Class
label: χωριό @el

ice hockey league
type: Class
label: ligue d'hockey sur glace @fr

has Lunar Crater
comment: Relation between Journalist and Lunar Crater
type: ObjectProperty
range: lunar crater
comment: Relazione tra Journalist e Lunar Crater @it
domain: journalist

inline hockey league
type: Class
label: ligue de roller inline hockey @fr

soccer club
type: Class
label: club de football @fr

has Planet
type: ObjectProperty
comment: Relation between Journalist and Planet
range: planet
domain: journalist
comment: Relazione tra Journalist e Planet @it

historic building
type: Class
label: bâtiment historique @fr

has Rocket
comment: Relazione tra Journalist e Rocket @it
range: rocket
domain: journalist
type: ObjectProperty
comment: Relation between Journalist and Rocket

baseball player
label: joueur de baseball @fr
type: Class

has Chancellor
domain: journalist
comment: Relation between Journalist and Chancellor
type: ObjectProperty
comment: Relazione tra Journalist e Chancellor @it
range: chancellor

has Weapon
type: ObjectProperty
range: weapon
domain: journalist
comment: Relazione tra Journalist e Weapon @it
comment: Relation between Journalist and Weapon

website
type: Class
label: site web @fr
label: Ιστότοπος @el

has Governor
comment: Relazione tra Journalist e Governor @it
range: governor
domain: journalist
type: ObjectProperty
comment: Relation between Journalist and Governor

has Mammal
comment: Relazione tra Journalist e Mammal @it
type: ObjectProperty
comment: Relation between Journalist and Mammal
domain: journalist
range: mammal

basketball player
type: Class
label: joueur de basketball @fr

adult actor
label: erwachsener Schauspieler @de
type: Class
label: acteur adulte @fr

has World Heritage Site
type: ObjectProperty
comment: Relation between Journalist and World Heritage Site
domain: journalist
comment: Relazione tra Journalist e World Heritage Site @it
range: World Heritage Site

has Musical Artist
comment: Relation between Journalist and Musical Artist
domain: journalist
range: musical artist
comment: Relazione tra Journalist e Musical Artist @it
type: ObjectProperty
related match: after

has Pope
domain: journalist
comment: Relazione tra Journalist e Pope @it
type: ObjectProperty
range: pope
comment: Relation between Journalist and Pope

has Beverage
range: beverage
comment: Relation between Journalist and Beverage
comment: Relazione tra Journalist e Beverage @it
domain: journalist
type: ObjectProperty

ice hockey player
label: joueur de hockey sur glace @fr
type: Class

has Film
domain: journalist
comment: Relazione tra Journalist e Film @it
comment: Relation between Journalist and Film
type: ObjectProperty
range: film

has Formula One Racer
range: Formula One racer
domain: journalist
comment: Relazione tra Journalist e Formula One Racer @it
comment: Relation between Journalist and Formula One Racer
type: ObjectProperty

has Bacteria
domain: journalist
type: ObjectProperty
comment: Relazione tra Journalist e Bacteria @it
comment: Relation between Journalist and Bacteria
range: bacteria

has Convention
comment: Relation between Journalist and Convention
range: convention
type: ObjectProperty
comment: Relazione tra Journalist e Convention @it
domain: journalist

has Mountain
range: mountain
comment: Relazione tra Journalist e Mountain @it
comment: Relation between Journalist and Mountain
domain: journalist
type: ObjectProperty

mountain range
label: chaîne de montagne @fr
type: Class

Christian Bishop
label: évêque chrétien @fr
type: Class

beverage
type: Class
label: boisson @fr

has Cyclist
comment: Relation between Journalist and Cyclist
type: ObjectProperty
domain: journalist
range: cyclist
comment: Relazione tra Journalist e Cyclist @it

planet
type: Class
label: planète @fr

has Trade Union
comment: Relation between Journalist and Trade Union
range: trade union
comment: Relazione tra Journalist e Trade Union @it
type: ObjectProperty
domain: journalist

scientist
label: scientifique @fr
type: Class
label: Wissenschaftler @de

has Album
comment: Relazione tra Journalist e Album @it
comment: Relation between Journalist and Album
range: album
domain: journalist
type: ObjectProperty

has Canal
type: ObjectProperty
comment: Relation between Journalist and Canal
domain: journalist
comment: Relazione tra Journalist e Canal @it
range: canal

golf league
label: ligue de golf @fr
type: Class

has Island
range: island
domain: journalist
comment: Relation between Journalist and Island
type: ObjectProperty
comment: Relazione tra Journalist e Island @it

has Adult Actor
range: adult actor
comment: Relation between Journalist and Adult Actor
type: ObjectProperty
domain: journalist
comment: Relazione tra Journalist e Adult Actor @it

olympics
type: Class
label: Jeux Olympiques @fr

has Philosopher
comment: Relazione tra Journalist e Philosopher @it
range: philosopher
domain: journalist
type: ObjectProperty
comment: Relation between Journalist and Philosopher

baseball league
type: Class
label: ligue de baseball @fr

bridge
type: Class
label: pont @fr

has Bone
range: bone
type: ObjectProperty
comment: Relation between Journalist and Bone
comment: Relazione tra Journalist e Bone @it
domain: journalist

has Cardinal
range: cardinal
comment: Relation between Journalist and Cardinal
type: ObjectProperty
domain: journalist
comment: Relazione tra Journalist e Cardinal @it

has Wrestler
comment: Relation between Journalist and Wrestler
range: wrestler
type: ObjectProperty
domain: journalist
comment: Relazione tra Journalist e Wrestler @it

mammal
label: mammifère @fr
type: Class

island
type: Class
label: νησί @el
label: île @fr

comics character
label: personnage de bandes dessinées @fr
type: Class

has Canadian Football League
domain: journalist
type: ObjectProperty
range: canadian football league
comment: Relazione tra Journalist e Canadian Football League @it
comment: Relation between Journalist and Canadian Football League

skyscraper
label: gratte-ciel @fr
type: Class

Formula One racer
label: pilote de formule 1 @fr
type: Class

has Park
type: ObjectProperty
comment: Relazione tra Journalist e Park @it
range: park
comment: Relation between Journalist and Park
domain: journalist

has Christian Bishop
comment: Relazione tra Journalist e Christian Bishop @it
domain: journalist
comment: Relation between Journalist and Christian Bishop
type: ObjectProperty
range: Christian Bishop

has Basketball League
domain: journalist
comment: Relation between Journalist and Basketball League
type: ObjectProperty
range: basketball league
comment: Relazione tra Journalist e Basketball League @it

has Music Genre
type: ObjectProperty
comment: Relazione tra Journalist e Music Genre @it
domain: journalist
comment: Relation between Journalist and Music Genre
range: music genre

bone
label: os @fr
label: Knochen @de
type: Class

member of parliament
type: Class
label: membre du Parlement @fr

has Currency
domain: journalist
type: ObjectProperty
comment: Relazione tra Journalist e Currency @it
comment: Relation between Journalist and Currency
range: currency

has Airport
comment: Relation between Journalist and Airport
domain: journalist
comment: Relazione tra Journalist e Airport @it
type: ObjectProperty
range: airport

has Skyscraper
domain: journalist
type: ObjectProperty
comment: Relation between Journalist and Skyscraper
range: skyscraper
comment: Relazione tra Journalist e Skyscraper @it

airport
label: aéroport @fr
label: Flughafen @de
type: Class