has Fictional Character
domain: legislature
comment: Relazione tra Legislature e Fictional Character @it
comment: Relation between Legislature and Fictional Character
type: ObjectProperty
range: fictional character

has American Football Player
comment: Relation between Legislature and American Football Player
type: ObjectProperty
domain: legislature
range: american football player
comment: Relazione tra Legislature e American Football Player @it

has Military Conflict
comment: Relation between Legislature and Military Conflict
comment: Relazione tra Legislature e Military Conflict @it
range: military conflict
type: ObjectProperty
domain: legislature

television show
label: émission de télévision @fr
type: Class

fictional character
label: personnage de fiction @fr
type: Class

has Shopping Mall
domain: legislature
type: ObjectProperty
range: shopping mall
comment: Relation between Legislature and Shopping Mall
comment: Relazione tra Legislature e Shopping Mall @it

park
label: parc @fr
type: Class

disease
label: maladie @fr
type: Class

cardinal
type: Class

has Broadcast
comment: Relazione tra Legislature e Broadcast @it
type: ObjectProperty
range: broadcast
domain: legislature
comment: Relation between Legislature and Broadcast

has Chancellor
domain: legislature
type: ObjectProperty
comment: Relazione tra Legislature e Chancellor @it
comment: Relation between Legislature and Chancellor
range: chancellor

has Chemical Compound
comment: Relation between Legislature and Chemical Compound
type: ObjectProperty
range: chemical compound
comment: Relazione tra Legislature e Chemical Compound @it
domain: legislature

has Soccer Player
domain: legislature
comment: Relazione tra Legislature e Soccer Player @it
range: soccer player
comment: Relation between Legislature and Soccer Player
type: ObjectProperty

has Ethnic Group
type: ObjectProperty
comment: Relazione tra Legislature e Ethnic Group @it
range: ethnic group
comment: Relation between Legislature and Ethnic Group
domain: legislature

colour
type: Class
label: couleur @fr
label: χρώμα @el

has Ice Hockey Player
comment: Relazione tra Legislature e Ice Hockey Player @it
type: ObjectProperty
domain: legislature
range: ice hockey player
comment: Relation between Legislature and Ice Hockey Player

has Bridge
comment: Relazione tra Legislature e Bridge @it
range: bridge
comment: Relation between Legislature and Bridge
type: ObjectProperty
domain: legislature

has Park
range: park
type: ObjectProperty
comment: Relazione tra Legislature e Park @it
domain: legislature
comment: Relation between Legislature and Park

has Judge
comment: Relazione tra Legislature e Judge @it
type: ObjectProperty
domain: legislature
range: judge
comment: Relation between Legislature and Judge

actor
label: acteur @fr
type: Class
label: Schauspieler @de

american football player
label: joueur de football américain @fr
type: Class

stadium
type: Class
label: stade @fr

has British Royalty
comment: Relazione tra Legislature e British Royalty @it
comment: Relation between Legislature and British Royalty
type: ObjectProperty
domain: legislature
range: British royalty

has Magazine
comment: Relation between Legislature and Magazine
domain: legislature
range: magazine
type: ObjectProperty
comment: Relazione tra Legislature e Magazine @it

Axiom
annotated target: meetingPlace
annotated source: has Skyscraper
matching quantification: 2

has Continent
comment: Relazione tra Legislature e Continent @it
type: ObjectProperty
comment: Relation between Legislature and Continent
range: continent
domain: legislature

has University
comment: Relation between Legislature and University
domain: legislature
range: university
comment: Relazione tra Legislature e University @it
type: ObjectProperty

has Military Unit
type: ObjectProperty
comment: Relazione tra Legislature e Military Unit @it
range: military unit
comment: Relation between Legislature and Military Unit
domain: legislature

has World Heritage Site
related match: meetingPlace
comment: Relation between Legislature and World Heritage Site
domain: legislature
comment: Relazione tra Legislature e World Heritage Site @it
type: ObjectProperty
range: World Heritage Site

has Scientist
comment: Relation between Legislature and Scientist
type: ObjectProperty
comment: Relazione tra Legislature e Scientist @it
range: scientist
domain: legislature

has Protected Area
comment: Relation between Legislature and Protected Area
comment: Relazione tra Legislature e Protected Area @it
range: protected area
type: ObjectProperty
domain: legislature

mountain
label: Βουνό @el
label: montagne @fr
type: Class

criminal
label: criminel @fr
type: Class

mayor
label: maire @fr
type: Class

has Book
range: book
comment: Relazione tra Legislature e Book @it
type: ObjectProperty
domain: legislature
comment: Relation between Legislature and Book

pope
label: pape @fr
type: Class

has Sport
range: sport
domain: legislature
comment: Relazione tra Legislature e Sport @it
type: ObjectProperty
comment: Relation between Legislature and Sport

has Stadium
type: ObjectProperty
range: stadium
comment: Relation between Legislature and Stadium
domain: legislature
comment: Relazione tra Legislature e Stadium @it

has Soccer Manager
comment: Relation between Legislature and Soccer Manager
domain: legislature
range: soccer manager
comment: Relazione tra Legislature e Soccer Manager @it
type: ObjectProperty

senator
label: sénateur @fr
type: Class

has Film
comment: Relazione tra Legislature e Film @it
comment: Relation between Legislature and Film
domain: legislature
type: ObjectProperty
range: film

has Disease
range: disease
comment: Relazione tra Legislature e Disease @it
type: ObjectProperty
comment: Relation between Legislature and Disease
domain: legislature

newspaper
type: Class
label: journal @fr

protected area
label: aire protégée @fr
label: προστατευμένη περιοχή @el
type: Class

road
label: route @fr
type: Class

has Mountain
type: ObjectProperty
comment: Relazione tra Legislature e Mountain @it
comment: Relation between Legislature and Mountain
domain: legislature
range: mountain

book
label: llibre @ca
label: książka @pl
label: βιβλίο @el
label: livre @fr
type: Class

judge
type: Class
label: juge @fr

Axiom
annotated source: has World Heritage Site
matching quantification: 5
annotated target: meetingPlace

World Heritage Site
label: site du patrimoine mondial @fr
type: Class

has River
range: river
comment: Relation between Legislature and River
domain: legislature
comment: Relazione tra Legislature e River @it
type: ObjectProperty

shopping mall
label: centre commercial @fr
type: Class

has Plant
range: plant
type: ObjectProperty
comment: Relazione tra Legislature e Plant @it
comment: Relation between Legislature and Plant
domain: legislature

non-profit organisation
label: organisation à but non lucratif @fr
type: Class

has Airport
type: ObjectProperty
comment: Relazione tra Legislature e Airport @it
comment: Relation between Legislature and Airport
range: airport
domain: legislature

lake
type: Class
label: lac @fr

has Album
comment: Relazione tra Legislature e Album @it
type: ObjectProperty
range: album
domain: legislature
comment: Relation between Legislature and Album

software
label: logiciel @fr
type: Class

has Cardinal
type: ObjectProperty
comment: Relazione tra Legislature e Cardinal @it
range: cardinal
domain: legislature
comment: Relation between Legislature and Cardinal

has Model
comment: Relation between Legislature and Model
type: ObjectProperty
domain: legislature
range: model
comment: Relazione tra Legislature e Model @it

has Trade Union
comment: Relazione tra Legislature e Trade Union @it
range: trade union
domain: legislature
comment: Relation between Legislature and Trade Union
type: ObjectProperty

governor
label: gouverneur @fr
type: Class

company
type: Class
label: entreprise @fr

has Governor
domain: legislature
range: governor
type: ObjectProperty
comment: Relation between Legislature and Governor
comment: Relazione tra Legislature e Governor @it

has Christian Bishop
comment: Relazione tra Legislature e Christian Bishop @it
domain: legislature
type: ObjectProperty
comment: Relation between Legislature and Christian Bishop
range: Christian Bishop

river
type: Class
label: rivière @fr

magazine
type: Class
label: περιοδικό @el

school
label: école @fr
type: Class

has Museum
comment: Relation between Legislature and Museum
type: ObjectProperty
range: museum
comment: Relazione tra Legislature e Museum @it
domain: legislature

has Hospital
domain: legislature
type: ObjectProperty
range: hospital
comment: Relation between Legislature and Hospital
comment: Relazione tra Legislature e Hospital @it

museum
type: Class
label: musée @fr

trade union
label: syndicat professionnel @fr
type: Class

military person
type: Class
label: militaire @fr

has Colour
comment: Relazione tra Legislature e Colour @it
range: colour
comment: Relation between Legislature and Colour
type: ObjectProperty
domain: legislature

philosopher
type: Class
label: philosophe @fr

award
label: récompense @fr
type: Class

currency
label: devise @fr
type: Class

British royalty
type: Class
label: royauté Britannique @fr

has Television Show
domain: legislature
range: television show
comment: Relazione tra Legislature e Television Show @it
type: ObjectProperty
comment: Relation between Legislature and Television Show

has Road
range: road
domain: legislature
type: ObjectProperty
comment: Relation between Legislature and Road
comment: Relazione tra Legislature e Road @it

hospital
type: Class
label: hôpital @fr

has Lake
type: ObjectProperty
comment: Relation between Legislature and Lake
comment: Relazione tra Legislature e Lake @it
domain: legislature
range: lake

sport
type: Class

town
type: Class
label: ville @fr

university
type: Class
label: université @fr
label: πανεπιστήμιο @el

has Member Of Parliament
domain: legislature
comment: Relazione tra Legislature e Member Of Parliament @it
range: member of parliament
comment: Relation between Legislature and Member Of Parliament
type: ObjectProperty

continent
label: ήπειρος @el
type: Class

ethnic group
label: groupe ethnique @fr
type: Class

album
type: Class
label: Album @de

has Baseball Player
comment: Relazione tra Legislature e Baseball Player @it
range: baseball player
comment: Relation between Legislature and Baseball Player
domain: legislature
type: ObjectProperty

has Town
comment: Relazione tra Legislature e Town @it
domain: legislature
comment: Relation between Legislature and Town
type: ObjectProperty
range: town

has Website
range: website
type: ObjectProperty
comment: Relazione tra Legislature e Website @it
domain: legislature
comment: Relation between Legislature and Website

has Monarch
domain: legislature
range: monarch
comment: Relazione tra Legislature e Monarch @it
comment: Relation between Legislature and Monarch
type: ObjectProperty

has Village
range: village
type: ObjectProperty
comment: Relazione tra Legislature e Village @it
comment: Relation between Legislature and Village
domain: legislature

military unit
type: Class
label: unité militaire @fr

has School
comment: Relation between Legislature and School
comment: Relazione tra Legislature e School @it
type: ObjectProperty
domain: legislature
range: school

has Senator
type: ObjectProperty
domain: legislature
comment: Relation between Legislature and Senator
comment: Relazione tra Legislature e Senator @it
range: senator
related match: leader

soccer manager
label: entraîneur de football @fr
type: Class

village
label: χωριό @el
type: Class

has Supreme Court Of The United States Case
comment: Relation between Legislature and Supreme Court Of The United States Case
domain: legislature
comment: Relazione tra Legislature e Supreme Court Of The United States Case @it
type: ObjectProperty
range: Supreme Court of the United States case

has Radio Station
comment: Relazione tra Legislature e Radio Station @it
comment: Relation between Legislature and Radio Station
range: radio station
domain: legislature
type: ObjectProperty

has Company
comment: Relazione tra Legislature e Company @it
comment: Relation between Legislature and Company
type: ObjectProperty
domain: legislature
range: company

writer
label: écrivain @fr
type: Class

baseball player
label: joueur de baseball @fr
type: Class

military conflict
type: Class
label: conflit militaire @fr

architect
label: architecte @fr
type: Class

website
label: Ιστότοπος @el
label: site web @fr
type: Class

model
label: mannequin @fr
type: Class

ambassador
label: ambassadeur @fr
type: Class

has Criminal
range: criminal
comment: Relazione tra Legislature e Criminal @it
type: ObjectProperty
comment: Relation between Legislature and Criminal
domain: legislature

has Software
domain: legislature
comment: Relazione tra Legislature e Software @it
range: software
type: ObjectProperty
comment: Relation between Legislature and Software

has Philosopher
range: philosopher
comment: Relation between Legislature and Philosopher
domain: legislature
comment: Relazione tra Legislature e Philosopher @it
type: ObjectProperty

has Writer
type: ObjectProperty
comment: Relation between Legislature and Writer
comment: Relazione tra Legislature e Writer @it
range: writer
domain: legislature

ice hockey player
type: Class
label: joueur de hockey sur glace @fr

has Architect
domain: legislature
range: architect
comment: Relazione tra Legislature e Architect @it
comment: Relation between Legislature and Architect
type: ObjectProperty

Christian Bishop
type: Class
label: évêque chrétien @fr

has Congressman
range: congressman
domain: legislature
comment: Relazione tra Legislature e Congressman @it
comment: Relation between Legislature and Congressman
type: ObjectProperty

has Ambassador
domain: legislature
comment: Relation between Legislature and Ambassador
type: ObjectProperty
range: ambassador
comment: Relazione tra Legislature e Ambassador @it

chancellor
type: Class
label: chancelier @fr

has Military Person
type: ObjectProperty
domain: legislature
range: military person
comment: Relazione tra Legislature e Military Person @it
comment: Relation between Legislature and Military Person

has Newspaper
comment: Relazione tra Legislature e Newspaper @it
comment: Relation between Legislature and Newspaper
range: newspaper
domain: legislature
type: ObjectProperty

soccer player
label: joueur de football @fr
type: Class

scientist
label: Wissenschaftler @de
type: Class
label: scientifique @fr

legislature
type: Class
label: pouvoir législatif @fr

Axiom
annotated source: has Senator
annotated target: leader
matching quantification: 1

has Island
type: ObjectProperty
domain: legislature
range: island
comment: Relation between Legislature and Island
comment: Relazione tra Legislature e Island @it

has Currency
domain: legislature
comment: Relazione tra Legislature e Currency @it
comment: Relation between Legislature and Currency
range: currency
type: ObjectProperty

monarch
type: Class
label: monarque @fr

congressman
type: Class
label: membre du Congrès @fr

has Pope
comment: Relation between Legislature and Pope
comment: Relazione tra Legislature e Pope @it
domain: legislature
type: ObjectProperty
range: pope

bridge
type: Class
label: pont @fr

has Golf Player
domain: legislature
type: ObjectProperty
range: golf player
comment: Relation between Legislature and Golf Player
comment: Relazione tra Legislature e Golf Player @it

golf player
type: Class
label: golfeur @fr

has Actor
type: ObjectProperty
range: actor
comment: Relazione tra Legislature e Actor @it
domain: legislature
comment: Relation between Legislature and Actor

has Musical Artist
comment: Relazione tra Legislature e Musical Artist @it
range: musical artist
comment: Relation between Legislature and Musical Artist
type: ObjectProperty
domain: legislature

plant
label: plante @fr
type: Class

broadcast
label: Émission de télévision @fr
type: Class

film
type: Class
label: ταινία @el

has Skyscraper
range: skyscraper
domain: legislature
type: ObjectProperty
comment: Relation between Legislature and Skyscraper
comment: Relazione tra Legislature e Skyscraper @it
related match: meetingPlace

island
label: île @fr
label: νησί @el
type: Class

has Award
comment: Relation between Legislature and Award
range: award
type: ObjectProperty
comment: Relazione tra Legislature e Award @it
domain: legislature

Supreme Court of the United States case
type: Class
label: cas juridique de la Cour suprême des États-Unis @fr

has Non- Profit Organisation
range: non-profit organisation
domain: legislature
type: ObjectProperty
comment: Relazione tra Legislature e Non- Profit Organisation @it
comment: Relation between Legislature and Non- Profit Organisation

chemical compound
label: produit chimique @fr
type: Class

skyscraper
type: Class
label: gratte-ciel @fr

radio station
label: station de radio @fr
type: Class

member of parliament
type: Class
label: membre du Parlement @fr

Ontology
extracted from: dbpedia.org
has author: Valentina Presutti
has author: Andrea Giovanni Nuzzolese
imports: cpannotationschema.owl
has author: Aldo Gangemi
comment: Legislature Encyclopedic Knowledge Pattern
has intent: To represent the encyclopedic knowledge expressed by an object typed as Legislature
extracted from: en.wikipedia.org

musical artist
label: musicien @fr
type: Class
label: artista musical @pt

has Mayor
comment: Relazione tra Legislature e Mayor @it
comment: Relation between Legislature and Mayor
type: ObjectProperty
domain: legislature
range: mayor

airport
type: Class
label: Flughafen @de
label: aéroport @fr