Axiom
matching quantification: 1
annotated target: shipArmament
annotated source: has Company

Axiom
annotated source: has Scientist
annotated target: shipNamesake
matching quantification: 1

Axiom
annotated target: shipOperator
matching quantification: 1
annotated source: has Military Unit

television show
type: Class
label: émission de télévision @fr

Axiom
matching quantification: 1
annotated source: has Automobile
annotated target: transmission

has Amphibian
comment: Relation between Mean Of Transportation and Amphibian
comment: Relazione tra Mean Of Transportation e Amphibian @it
domain: mean of transportation
range: amphibian
type: ObjectProperty

Axiom
annotated target: nicknames
matching quantification: 1
annotated source: has Eukaryote

Axiom
annotated source: has Town
annotated target: shipRoute
matching quantification: 2

automobile
type: Class

colour
type: Class
label: couleur @fr
label: χρώμα @el

has Song
type: ObjectProperty
range: song
comment: Relation between Mean Of Transportation and Song
comment: Relazione tra Mean Of Transportation e Song @it
domain: mean of transportation

Election
label: élection @fr
type: Class

Axiom
matching quantification: 30
annotated target: builders
annotated source: has Historic Place

mean of transportation
type: Class
label: moyen de transport @fr

Axiom
annotated target: shipBuilder
annotated source: has Country
matching quantification: 3

Axiom
annotated source: has Company
annotated target: operators
matching quantification: 4

Axiom
matching quantification: 14
annotated source: has Village
annotated target: assembly

has Canadian Football Team
range: canadian football team
domain: mean of transportation
comment: Relazione tra Mean Of Transportation e Canadian Football Team @it
type: ObjectProperty
comment: Relation between Mean Of Transportation and Canadian Football Team

Axiom
matching quantification: 7
annotated target: parentCompany
annotated source: has Company

Axiom
matching quantification: 300
annotated source: has Automobile
annotated target: similar

Axiom
matching quantification: 2
annotated source: has Automobile
annotated target: platform

has Space Mission
comment: Relazione tra Mean Of Transportation e Space Mission @it
domain: mean of transportation
type: ObjectProperty
comment: Relation between Mean Of Transportation and Space Mission
range: space mission
related match: before
related match: crew
related match: after

Axiom
annotated target: shipHomeport
annotated source: has Country
matching quantification: 2

Axiom
matching quantification: 19
annotated target: moreUsers
annotated source: has Company

Axiom
matching quantification: 102
annotated target: builders
annotated source: has Company

Axiom
matching quantification: 17
annotated target: moreUsers
annotated source: has Airline

species
type: Class
label: espèce @fr

Axiom
matching quantification: 213
annotated target: operations
annotated source: has Military Conflict

has Basketball Team
range: basketball team
comment: Relation between Mean Of Transportation and Basketball Team
domain: mean of transportation
comment: Relazione tra Mean Of Transportation e Basketball Team @it
type: ObjectProperty

Axiom
matching quantification: 1
annotated source: has Military Unit
annotated target: shipOperators

Axiom
annotated target: shipHomeport
annotated source: has Place
matching quantification: 24

has Award
comment: Relation between Mean Of Transportation and Award
comment: Relazione tra Mean Of Transportation e Award @it
domain: mean of transportation
type: ObjectProperty
range: award

has Valley
comment: Relazione tra Mean Of Transportation e Valley @it
range: valley
type: ObjectProperty
comment: Relation between Mean Of Transportation and Valley
domain: mean of transportation

has Trade Union
range: trade union
comment: Relation between Mean Of Transportation and Trade Union
comment: Relazione tra Mean Of Transportation e Trade Union @it
type: ObjectProperty
domain: mean of transportation

road
type: Class
label: route @fr

Axiom
annotated target: contractors
annotated source: has Organisation
matching quantification: 1

boxer
label: boxeur @fr
type: Class

has Country
related match: builders
related match: shipBuilder
related match: assembly
comment: Relazione tra Mean Of Transportation e Country @it
comment: Relation between Mean Of Transportation and Country
type: ObjectProperty
related match: builder
related match: operators
related match: shipCountry
domain: mean of transportation
related match: shipHomeport
related match: moreUsers
range: country
related match: production
related match: locale
related match: assembly percent C2 percent A0

judge
label: juge @fr
type: Class

Axiom
annotated source: has Company
matching quantification: 96
annotated target: shipBuilder

Axiom
annotated target: related
matching quantification: 2
annotated source: has Weapon

World Heritage Site
label: site du patrimoine mondial @fr
type: Class

Axiom
annotated target: railroad
matching quantification: 58
annotated source: has Company

Axiom
annotated source: has Company
annotated target: similar
matching quantification: 1

station
type: Class

Axiom
matching quantification: 61
annotated target: commanders
annotated source: has Military Person

Axiom
matching quantification: 1
annotated source: has Organisation
annotated target: shipArmament

Axiom
annotated source: has Rocket
annotated target: derivatives
matching quantification: 9

Axiom
matching quantification: 1
annotated target: after
annotated source: has Company

lake
label: lac @fr
type: Class

Axiom
annotated source: has Country
matching quantification: 4
annotated target: builder

has Bone
type: ObjectProperty
domain: mean of transportation
comment: Relazione tra Mean Of Transportation e Bone @it
comment: Relation between Mean Of Transportation and Bone
range: bone

Axiom
annotated target: moreUsers
annotated source: has Organisation
matching quantification: 223

arachnid
type: Class
label: arachnides @fr

has Baseball Player
range: baseball player
type: ObjectProperty
comment: Relation between Mean Of Transportation and Baseball Player
domain: mean of transportation
comment: Relazione tra Mean Of Transportation e Baseball Player @it

governor
type: Class
label: gouverneur @fr

administrative region
type: Class
label: région administrative @fr

Axiom
matching quantification: 9
annotated source: has Organisation
annotated target: shipFlag

has Television Episode
type: ObjectProperty
comment: Relation between Mean Of Transportation and Television Episode
domain: mean of transportation
comment: Relazione tra Mean Of Transportation e Television Episode @it
range: television episode

Axiom
annotated target: shipClass
annotated source: has Company
matching quantification: 4

has Locomotive
related match: preservedunits
range: locomotive
comment: Relation between Mean Of Transportation and Locomotive
type: ObjectProperty
related match: buildmodel
related match: railroadclass
domain: mean of transportation
comment: Relazione tra Mean Of Transportation e Locomotive @it
related match: currentowner

has City
related match: shipBuilder
domain: mean of transportation
related match: assembly percent C2 percent A0
related match: builders
comment: Relation between Mean Of Transportation and City
type: ObjectProperty
related match: currentowner
related match: shipRoute
related match: shipHomeport
comment: Relazione tra Mean Of Transportation e City @it
range: city
related match: locale
related match: assembly

Axiom
annotated source: has Organisation
matching quantification: 96
annotated target: shipBuilder

has Hospital
domain: mean of transportation
comment: Relation between Mean Of Transportation and Hospital
type: ObjectProperty
comment: Relazione tra Mean Of Transportation e Hospital @it
range: hospital

fish
label: poisson @fr
type: Class

Axiom
annotated target: primaryUser
matching quantification: 1
annotated source: has Company

has Model
domain: mean of transportation
range: model
type: ObjectProperty
comment: Relazione tra Mean Of Transportation e Model @it
comment: Relation between Mean Of Transportation and Model

tennis player
type: Class
label: joueur de tennis @fr

has Philosopher
comment: Relazione tra Mean Of Transportation e Philosopher @it
type: ObjectProperty
domain: mean of transportation
range: philosopher
comment: Relation between Mean Of Transportation and Philosopher

Axiom
matching quantification: 2
annotated target: shipNamesake
annotated source: has Person

Axiom
matching quantification: 1
annotated target: shipHomeport
annotated source: has Historic Place

Axiom
matching quantification: 1
annotated source: has Automobile
annotated target: competitors

prime minister
type: Class
label: premier ministre @fr

Axiom
matching quantification: 2
annotated source: has Person
annotated target: builder

race
type: Class
label: course @fr

has Flowering Plant
type: ObjectProperty
comment: Relation between Mean Of Transportation and Flowering Plant
range: flowering plant
comment: Relazione tra Mean Of Transportation e Flowering Plant @it
domain: mean of transportation

Axiom
matching quantification: 90
annotated target: sites
annotated source: has Place

hospital
label: hôpital @fr
type: Class

has Grape
range: grape
domain: mean of transportation
type: ObjectProperty
comment: Relazione tra Mean Of Transportation e Grape @it
comment: Relation between Mean Of Transportation and Grape

has Person
comment: Relation between Mean Of Transportation and Person
related match: builder
related match: commanders
type: ObjectProperty
related match: shipNamesake
comment: Relazione tra Mean Of Transportation e Person @it
related match: designer
domain: mean of transportation
related match: shipBuilder
range: person

lunar crater
type: Class
label: cratère lunaire @fr

Axiom
matching quantification: 45
annotated target: shipBuilder
annotated source: has Place

Axiom
annotated source: has Organisation
annotated target: shipPropulsion
matching quantification: 1

Axiom
annotated source: has Military Conflict
matching quantification: 6
annotated target: shipHonours

has Road
comment: Relation between Mean Of Transportation and Road
type: ObjectProperty
comment: Relazione tra Mean Of Transportation e Road @it
domain: mean of transportation
range: road

Axiom
matching quantification: 116
annotated target: locale
annotated source: has Place

Axiom
annotated target: nicknames
annotated source: has Species
matching quantification: 1

album
label: Album @de
type: Class

president
label: président @fr
type: Class

Axiom
annotated source: has Place
matching quantification: 12
annotated target: shipRoute

has Shopping Mall
comment: Relation between Mean Of Transportation and Shopping Mall
domain: mean of transportation
comment: Relazione tra Mean Of Transportation e Shopping Mall @it
type: ObjectProperty
range: shopping mall

has Company
domain: mean of transportation
related match: shipArmament
related match: after
related match: engines
related match: shipBuilder
related match: designer
type: ObjectProperty
related match: assembly
related match: parentCompany
related match: contractors
range: company
related match: shipClass
related match: shipOperator
related match: operators
related match: manufacturers
related match: builders
related match: shipOwner
comment: Relation between Mean Of Transportation and Company
comment: Relazione tra Mean Of Transportation e Company @it
related match: transmission
related match: shipPropulsion
related match: railroad
related match: primaryUser
related match: currentowner
related match: manufacturer
related match: moreUsers
related match: builder
related match: similar
related match: related
related match: shipClassSociety

moss
type: Class
label: mousses @fr

has Record Label
type: ObjectProperty
range: record label
comment: Relazione tra Mean Of Transportation e Record Label @it
comment: Relation between Mean Of Transportation and Record Label
domain: mean of transportation

military unit
type: Class
label: unité militaire @fr

Axiom
matching quantification: 66
annotated target: successor
annotated source: has Automobile

has Album
type: ObjectProperty
range: album
comment: Relazione tra Mean Of Transportation e Album @it
domain: mean of transportation
comment: Relation between Mean Of Transportation and Album

Axiom
annotated target: builders
matching quantification: 1
annotated source: has Administrative Region

Axiom
annotated source: has Town
annotated target: shipBuilder
matching quantification: 2

has Station
type: ObjectProperty
comment: Relation between Mean Of Transportation and Station
domain: mean of transportation
comment: Relazione tra Mean Of Transportation e Station @it
range: station

soccer manager
label: entraîneur de football @fr
type: Class

basketball team
type: Class

Axiom
matching quantification: 7
annotated target: buildmodel
annotated source: has Locomotive

Axiom
annotated target: operators
annotated source: has Country
matching quantification: 2

has American Football Team
comment: Relazione tra Mean Of Transportation e American Football Team @it
domain: mean of transportation
type: ObjectProperty
range: american football team
comment: Relation between Mean Of Transportation and American Football Team

Axiom
annotated source: has Launch Pad
annotated target: sites
matching quantification: 56

crustacean
label: crustacés @fr
type: Class

Axiom
annotated target: shipOwner
annotated source: has Company
matching quantification: 5

Axiom
annotated source: has Space Station
annotated target: after
matching quantification: 1

film festival
type: Class
label: festival du film @fr

Axiom
annotated target: related
matching quantification: 1
annotated source: has Organisation

Axiom
annotated source: has Country
matching quantification: 2
annotated target: shipCountry

has Island
range: island
comment: Relazione tra Mean Of Transportation e Island @it
comment: Relation between Mean Of Transportation and Island
type: ObjectProperty
domain: mean of transportation
related match: assembly
related match: locale
related match: sites

has Office Holder
comment: Relazione tra Mean Of Transportation e Office Holder @it
domain: mean of transportation
range: office holder
type: ObjectProperty
comment: Relation between Mean Of Transportation and Office Holder

Axiom
annotated source: has Space Mission
annotated target: crew
matching quantification: 21

lighthouse
type: Class
label: phare @fr

has Power Station
domain: mean of transportation
range: power station
comment: Relazione tra Mean Of Transportation e Power Station @it
type: ObjectProperty
comment: Relation between Mean Of Transportation and Power Station

Axiom
annotated source: has Company
annotated target: designer
matching quantification: 2

Axiom
matching quantification: 3
annotated target: locale
annotated source: has Administrative Region

Axiom
matching quantification: 45
annotated target: assembly
annotated source: has Administrative Region

has Crustacean
comment: Relazione tra Mean Of Transportation e Crustacean @it
range: crustacean
type: ObjectProperty
comment: Relation between Mean Of Transportation and Crustacean
domain: mean of transportation

has Boxer
type: ObjectProperty
domain: mean of transportation
range: boxer
comment: Relazione tra Mean Of Transportation e Boxer @it
comment: Relation between Mean Of Transportation and Boxer

legislature
type: Class
label: pouvoir législatif @fr

Axiom
matching quantification: 1
annotated target: bodyStyle
annotated source: has Automobile

Axiom
annotated target: manufacturers
annotated source: has Organisation
matching quantification: 6

airline
label: compagnie aérienne @fr
type: Class

Axiom
annotated target: nicknames
matching quantification: 1
annotated source: has Mammal

Axiom
annotated source: has Organisation
matching quantification: 4
annotated target: shipClass

monarch
type: Class
label: monarque @fr

golf player
label: golfeur @fr
type: Class

nascar driver
label: pilote de la nascar @fr
type: Class

has Judge
domain: mean of transportation
comment: Relazione tra Mean Of Transportation e Judge @it
range: judge
comment: Relation between Mean Of Transportation and Judge
type: ObjectProperty

space mission
type: Class
label: διαστημική αποστολή @el
label: mission spatiale @fr

Axiom
matching quantification: 1
annotated target: shipNamesake
annotated source: has River

insect
type: Class
label: insecte @fr

Axiom
matching quantification: 91
annotated target: builder
annotated source: has Company

film
label: ταινία @el
type: Class

has Year In Spaceflight
domain: mean of transportation
comment: Relazione tra Mean Of Transportation e Year In Spaceflight @it
comment: Relation between Mean Of Transportation and Year In Spaceflight
type: ObjectProperty
range: year in spaceflight

has Automobile Engine
related match: similar
related match: engine
comment: Relation between Mean Of Transportation and Automobile Engine
domain: mean of transportation
comment: Relazione tra Mean Of Transportation e Automobile Engine @it
type: ObjectProperty
range: automobile engine

Axiom
matching quantification: 3
annotated target: assembly percent C2 percent A0
annotated source: has Country

has Politician
range: politician
comment: Relazione tra Mean Of Transportation e Politician @it
domain: mean of transportation
type: ObjectProperty
comment: Relation between Mean Of Transportation and Politician

Supreme Court of the United States case
type: Class
label: cas juridique de la Cour suprême des États-Unis @fr

has Body Of Water
related match: shipNamesake
related match: location
range: body of water
type: ObjectProperty
comment: Relation between Mean Of Transportation and Body Of Water
domain: mean of transportation
comment: Relazione tra Mean Of Transportation e Body Of Water @it

Axiom
annotated target: shipOwner
annotated source: has Organisation
matching quantification: 5

Axiom
annotated target: currentowner
matching quantification: 2
annotated source: has Organisation

Axiom
annotated source: has Automobile
annotated target: predecessor
matching quantification: 90

Ontology
has author: Andrea Giovanni Nuzzolese
has intent: To represent the encyclopedic knowledge expressed by an object typed as MeanOfTransportation
imports: cpannotationschema.owl
has author: Aldo Gangemi
extracted from: en.wikipedia.org
has author: Valentina Presutti
extracted from: dbpedia.org
comment: MeanOfTransportation Encyclopedic Knowledge Pattern

Axiom
matching quantification: 71
annotated source: has Military Unit
annotated target: operators

fungus
label: fungi @fr
type: Class

musical artist
label: artista musical @pt
type: Class
label: musicien @fr

has Comics Character
range: comics character
domain: mean of transportation
comment: Relazione tra Mean Of Transportation e Comics Character @it
comment: Relation between Mean Of Transportation and Comics Character
type: ObjectProperty

eukaryote
type: Class
label: eucaryote @fr

has Ambassador
range: ambassador
type: ObjectProperty
comment: Relazione tra Mean Of Transportation e Ambassador @it
domain: mean of transportation
comment: Relation between Mean Of Transportation and Ambassador

has School
range: school
domain: mean of transportation
comment: Relazione tra Mean Of Transportation e School @it
type: ObjectProperty
comment: Relation between Mean Of Transportation and School

park
type: Class
label: parc @fr

has Grand Prix
range: Grand Prix
domain: mean of transportation
comment: Relation between Mean Of Transportation and Grand Prix
comment: Relazione tra Mean Of Transportation e Grand Prix @it
type: ObjectProperty

has Member Of Parliament
type: ObjectProperty
range: member of parliament
comment: Relation between Mean Of Transportation and Member Of Parliament
domain: mean of transportation
comment: Relazione tra Mean Of Transportation e Member Of Parliament @it

cardinal
type: Class

rugby player
label: joueur de rugby @fr
type: Class

has Military Person
related match: commanders
comment: Relation between Mean Of Transportation and Military Person
range: military person
type: ObjectProperty
domain: mean of transportation
comment: Relazione tra Mean Of Transportation e Military Person @it

has Basketball Player
comment: Relation between Mean Of Transportation and Basketball Player
type: ObjectProperty
domain: mean of transportation
comment: Relazione tra Mean Of Transportation e Basketball Player @it
range: basketball player

has Non- Profit Organisation
comment: Relazione tra Mean Of Transportation e Non- Profit Organisation @it
type: ObjectProperty
comment: Relation between Mean Of Transportation and Non- Profit Organisation
domain: mean of transportation
range: non-profit organisation

Axiom
annotated source: has Locomotive
matching quantification: 2
annotated target: railroadclass

has Music Genre
comment: Relation between Mean Of Transportation and Music Genre
range: music genre
comment: Relazione tra Mean Of Transportation e Music Genre @it
type: ObjectProperty
domain: mean of transportation

has College Coach
range: college coach
comment: Relazione tra Mean Of Transportation e College Coach @it
type: ObjectProperty
domain: mean of transportation
comment: Relation between Mean Of Transportation and College Coach

Axiom
annotated source: has City
matching quantification: 4
annotated target: shipBuilder

has Mollusca
domain: mean of transportation
range: mollusca
comment: Relazione tra Mean Of Transportation e Mollusca @it
type: ObjectProperty
comment: Relation between Mean Of Transportation and Mollusca

Axiom
annotated target: preservedunits
annotated source: has Locomotive
matching quantification: 1

Axiom
annotated source: has Automobile
annotated target: aka
matching quantification: 46

has Rocket
comment: Relation between Mean Of Transportation and Rocket
domain: mean of transportation
type: ObjectProperty
range: rocket
comment: Relazione tra Mean Of Transportation e Rocket @it
related match: comparable
related match: derivatives
related match: variantsWithTheirOwnArticles

has Software
comment: Relation between Mean Of Transportation and Software
domain: mean of transportation
comment: Relazione tra Mean Of Transportation e Software @it
range: software
type: ObjectProperty
related match: format

has Film
type: ObjectProperty
range: film
comment: Relazione tra Mean Of Transportation e Film @it
comment: Relation between Mean Of Transportation and Film
domain: mean of transportation

has Organisation
type: ObjectProperty
related match: designer
related match: builder
related match: manufacturer
related match: manufacturers
related match: shipOperator
related match: shipFlag
related match: shipOperators
related match: operators
related match: currentowner
related match: moreUsers
domain: mean of transportation
related match: contractors
related match: assembly
related match: after
related match: shipPropulsion
comment: Relation between Mean Of Transportation and Organisation
related match: shipBuilder
related match: partof
related match: shipArmament
related match: shipClass
related match: primaryUser
related match: builders
related match: transmission
related match: railroad
related match: engines
range: organisation
related match: related
related match: similar
comment: Relazione tra Mean Of Transportation e Organisation @it
related match: shipClassSociety
related match: parentCompany
related match: shipOwner

basketball league
type: Class
label: ligue de basketball @fr

has Insect
domain: mean of transportation
type: ObjectProperty
comment: Relazione tra Mean Of Transportation e Insect @it
comment: Relation between Mean Of Transportation and Insect
range: insect

has Colour
type: ObjectProperty
comment: Relazione tra Mean Of Transportation e Colour @it
domain: mean of transportation
range: colour
comment: Relation between Mean Of Transportation and Colour

Axiom
annotated target: shipRoute
matching quantification: 3
annotated source: has City

has Language
type: ObjectProperty
comment: Relation between Mean Of Transportation and Language
comment: Relazione tra Mean Of Transportation e Language @it
range: language
domain: mean of transportation

Axiom
matching quantification: 22
annotated target: locale
annotated source: has Island

has Launch Pad
range: launch pad
comment: Relazione tra Mean Of Transportation e Launch Pad @it
domain: mean of transportation
type: ObjectProperty
comment: Relation between Mean Of Transportation and Launch Pad
related match: sites

flowering plant
label: angiospermes @fr
type: Class

senator
label: sénateur @fr
type: Class

saint
type: Class

has Spacecraft
type: ObjectProperty
range: spacecraft
domain: mean of transportation
comment: Relazione tra Mean Of Transportation e Spacecraft @it
comment: Relation between Mean Of Transportation and Spacecraft

has Cricketer
comment: Relation between Mean Of Transportation and Cricketer
comment: Relazione tra Mean Of Transportation e Cricketer @it
type: ObjectProperty
range: cricketer
domain: mean of transportation

valley
type: Class
label: vallée @fr

has Film Festival
comment: Relazione tra Mean Of Transportation e Film Festival @it
comment: Relation between Mean Of Transportation and Film Festival
domain: mean of transportation
type: ObjectProperty
range: film festival

song
label: chanson @fr
type: Class

Axiom
annotated target: shipBuilder
matching quantification: 1
annotated source: has Historic Place

has Musical Artist
comment: Relazione tra Mean Of Transportation e Musical Artist @it
range: musical artist
domain: mean of transportation
comment: Relation between Mean Of Transportation and Musical Artist
type: ObjectProperty

convention
label: congrès @fr
type: Class

book
label: llibre @ca
label: książka @pl
label: βιβλίο @el
label: livre @fr
type: Class

Axiom
annotated target: builders
matching quantification: 75
annotated source: has Place

has Animal
comment: Relazione tra Mean Of Transportation e Animal @it
domain: mean of transportation
comment: Relation between Mean Of Transportation and Animal
range: animal
type: ObjectProperty
related match: nicknames

shopping mall
type: Class
label: centre commercial @fr

Axiom
matching quantification: 6
annotated source: has Automobile Engine
annotated target: engine

has Military Conflict
related match: partof
range: military conflict
type: ObjectProperty
related match: shipHonours
domain: mean of transportation
related match: shipNamesake
comment: Relation between Mean Of Transportation and Military Conflict
related match: operations
comment: Relazione tra Mean Of Transportation e Military Conflict @it

ski area
label: domaine skiable @fr
type: Class

has Currency
range: currency
type: ObjectProperty
comment: Relazione tra Mean Of Transportation e Currency @it
comment: Relation between Mean Of Transportation and Currency
domain: mean of transportation

space station
label: station spatiale @fr
type: Class

non-profit organisation
label: organisation à but non lucratif @fr
type: Class

has Ski Area
domain: mean of transportation
type: ObjectProperty
comment: Relazione tra Mean Of Transportation e Ski Area @it
comment: Relation between Mean Of Transportation and Ski Area
range: ski area

canadian football league
type: Class

Axiom
matching quantification: 1
annotated target: sites
annotated source: has Island

wine region
label: région viticole @fr
type: Class

weapon
type: Class
label: arme @fr

company
type: Class
label: entreprise @fr

has Single
type: ObjectProperty
domain: mean of transportation
range: single
comment: Relation between Mean Of Transportation and Single
comment: Relazione tra Mean Of Transportation e Single @it

has Gridiron Football Player
comment: Relazione tra Mean Of Transportation e Gridiron Football Player @it
range: gridiron football player
type: ObjectProperty
comment: Relation between Mean Of Transportation and Gridiron Football Player
domain: mean of transportation

philosopher
label: philosophe @fr
type: Class

has Species
range: species
type: ObjectProperty
comment: Relation between Mean Of Transportation and Species
comment: Relazione tra Mean Of Transportation e Species @it
domain: mean of transportation
related match: nicknames

sport
type: Class

Axiom
annotated source: has Weapon
annotated target: shipSailPlan
matching quantification: 1

Axiom
annotated target: transmission
annotated source: has Organisation
matching quantification: 1

automobile engine
type: Class
label: moteur d'automobile @fr

Axiom
matching quantification: 9
annotated target: shipFlag
annotated source: has Military Unit

Band
label: groupe de musique @fr
type: Class
label: Musikgruppe @de
label: banda @pt

town
type: Class
label: ville @fr

university
label: πανεπιστήμιο @el
label: université @fr
type: Class

auto racing league
type: Class
label: la ligue de course automobile @fr

Axiom
matching quantification: 1
annotated target: railroad
annotated source: has Historic Place

has Soccer Player
comment: Relation between Mean Of Transportation and Soccer Player
range: soccer player
type: ObjectProperty
domain: mean of transportation
comment: Relazione tra Mean Of Transportation e Soccer Player @it

Axiom
annotated source: has Organisation
annotated target: assembly
matching quantification: 1

Axiom
annotated source: has Place
matching quantification: 15
annotated target: builder

Axiom
annotated target: sites
matching quantification: 27
annotated source: has Historic Place

Axiom
annotated target: operators
annotated source: has Place
matching quantification: 2

has Eurovision Song Contest Entry
comment: Relation between Mean Of Transportation and Eurovision Song Contest Entry
comment: Relazione tra Mean Of Transportation e Eurovision Song Contest Entry @it
domain: mean of transportation
type: ObjectProperty
range: Eurovision song contest entry

hotel
type: Class
label: hôtel @fr

Axiom
annotated source: has Organisation
matching quantification: 112
annotated target: manufacturer

has Fern
comment: Relazione tra Mean Of Transportation e Fern @it
range: fern
domain: mean of transportation
comment: Relation between Mean Of Transportation and Fern
type: ObjectProperty

politician
type: Class
label: politicien @fr

has Site Of Special Scientific Interest
range: Site of Special Scientific Interest
type: ObjectProperty
domain: mean of transportation
comment: Relation between Mean Of Transportation and Site Of Special Scientific Interest
comment: Relazione tra Mean Of Transportation e Site Of Special Scientific Interest @it

has Game
domain: mean of transportation
type: ObjectProperty
comment: Relazione tra Mean Of Transportation e Game @it
comment: Relation between Mean Of Transportation and Game
range: game

has Band
comment: Relation between Mean Of Transportation and Band
range: Band
type: ObjectProperty
comment: Relazione tra Mean Of Transportation e Band @it
domain: mean of transportation

Axiom
annotated target: partof
matching quantification: 399
annotated source: has Military Unit

village
type: Class
label: χωριό @el

Axiom
annotated source: has Automobile
matching quantification: 37
annotated target: vehicles

office holder
label: titulaire @fr
label: Amtsinhaber @de
type: Class

baseball player
label: joueur de baseball @fr
type: Class

has Prime Minister
type: ObjectProperty
range: prime minister
comment: Relation between Mean Of Transportation and Prime Minister
comment: Relazione tra Mean Of Transportation e Prime Minister @it
domain: mean of transportation

has Ethnic Group
type: ObjectProperty
comment: Relation between Mean Of Transportation and Ethnic Group
range: ethnic group
comment: Relazione tra Mean Of Transportation e Ethnic Group @it
domain: mean of transportation

website
type: Class
label: site web @fr
label: Ιστότοπος @el

grape
label: raisin @fr
type: Class

Axiom
annotated target: sites
annotated source: has Airport
matching quantification: 6

Axiom
annotated source: has Company
matching quantification: 1
annotated target: assembly

has Actor
domain: mean of transportation
range: actor
type: ObjectProperty
comment: Relazione tra Mean Of Transportation e Actor @it
comment: Relation between Mean Of Transportation and Actor

Axiom
annotated source: has Automobile
matching quantification: 2
annotated target: sharesWith

Axiom
annotated source: has Company
matching quantification: 1
annotated target: engines

basketball player
label: joueur de basketball @fr
type: Class

Axiom
annotated source: has Rocket
matching quantification: 6
annotated target: comparable

Axiom
annotated source: has Person
annotated target: commanders
matching quantification: 61

has Congressman
domain: mean of transportation
type: ObjectProperty
comment: Relazione tra Mean Of Transportation e Congressman @it
comment: Relation between Mean Of Transportation and Congressman
range: congressman

has Anatomical Structure
range: anatomical structure
comment: Relation between Mean Of Transportation and Anatomical Structure
comment: Relazione tra Mean Of Transportation e Anatomical Structure @it
type: ObjectProperty
domain: mean of transportation

ice hockey player
label: joueur de hockey sur glace @fr
type: Class

has Historic Building
type: ObjectProperty
range: historic building
comment: Relazione tra Mean Of Transportation e Historic Building @it
domain: mean of transportation
comment: Relation between Mean Of Transportation and Historic Building

has Lake
comment: Relazione tra Mean Of Transportation e Lake @it
comment: Relation between Mean Of Transportation and Lake
range: lake
type: ObjectProperty
domain: mean of transportation

beverage
type: Class
label: boisson @fr

has Disease
range: disease
comment: Relation between Mean Of Transportation and Disease
domain: mean of transportation
type: ObjectProperty
comment: Relazione tra Mean Of Transportation e Disease @it

Axiom
annotated source: has Body Of Water
matching quantification: 1
annotated target: location

Axiom
annotated source: has Automobile
annotated target: before
matching quantification: 6

has American Football Player
type: ObjectProperty
range: american football player
domain: mean of transportation
comment: Relazione tra Mean Of Transportation e American Football Player @it
comment: Relation between Mean Of Transportation and American Football Player

Axiom
matching quantification: 1
annotated target: shipLaunched
annotated source: has Place

planet
label: planète @fr
type: Class

has Nascar Driver
domain: mean of transportation
comment: Relation between Mean Of Transportation and Nascar Driver
comment: Relazione tra Mean Of Transportation e Nascar Driver @it
type: ObjectProperty
range: nascar driver

has Weapon
related match: related
related match: shipArmament
related match: shipAircraft
range: weapon
comment: Relation between Mean Of Transportation and Weapon
domain: mean of transportation
related match: shipSailPlan
type: ObjectProperty
comment: Relazione tra Mean Of Transportation e Weapon @it

scientist
label: scientifique @fr
type: Class
label: Wissenschaftler @de

has Beverage
type: ObjectProperty
range: beverage
domain: mean of transportation
comment: Relation between Mean Of Transportation and Beverage
comment: Relazione tra Mean Of Transportation e Beverage @it

has Magazine
comment: Relation between Mean Of Transportation and Magazine
comment: Relazione tra Mean Of Transportation e Magazine @it
type: ObjectProperty
range: magazine
domain: mean of transportation

Axiom
matching quantification: 28
annotated source: has Place
annotated target: moreUsers

has Olympics
comment: Relazione tra Mean Of Transportation e Olympics @it
domain: mean of transportation
comment: Relation between Mean Of Transportation and Olympics
type: ObjectProperty
range: olympics

Axiom
matching quantification: 1
annotated source: has Animal
annotated target: nicknames

olympics
label: Jeux Olympiques @fr
type: Class

has Automobile
related match: after
domain: mean of transportation
related match: successor
related match: platform
related match: predecessors
related match: competition
related match: related
type: ObjectProperty
related match: aka
comment: Relazione tra Mean Of Transportation e Automobile @it
related match: sharesWith
range: automobile
related match: bodyStyle
related match: similar
related match: before
comment: Relation between Mean Of Transportation and Automobile
related match: predecessor
related match: competitors
related match: vehicles
related match: transmission

bridge
label: pont @fr
type: Class

has Saint
type: ObjectProperty
domain: mean of transportation
range: saint
comment: Relazione tra Mean Of Transportation e Saint @it
comment: Relation between Mean Of Transportation and Saint

has Senator
range: senator
type: ObjectProperty
comment: Relation between Mean Of Transportation and Senator
domain: mean of transportation
comment: Relazione tra Mean Of Transportation e Senator @it

Axiom
matching quantification: 1
annotated target: manufacturer
annotated source: has Place

Axiom
matching quantification: 2
annotated target: shipOperator
annotated source: has Company

Axiom
annotated source: has Place
annotated target: currentowner
matching quantification: 6

broadcast
label: Émission de télévision @fr
type: Class

has Supreme Court Of The United States Case
range: Supreme Court of the United States case
comment: Relation between Mean Of Transportation and Supreme Court Of The United States Case
type: ObjectProperty
comment: Relazione tra Mean Of Transportation e Supreme Court Of The United States Case @it
domain: mean of transportation

island
type: Class
label: νησί @el
label: île @fr

Axiom
matching quantification: 15
annotated target: primaryUser
annotated source: has Organisation

comics character
type: Class
label: personnage de bandes dessinées @fr

Axiom
annotated source: has Country
matching quantification: 3
annotated target: builders

Formula One racer
label: pilote de formule 1 @fr
type: Class

has Monument
domain: mean of transportation
comment: Relation between Mean Of Transportation and Monument
range: monument
type: ObjectProperty
comment: Relazione tra Mean Of Transportation e Monument @it

skyscraper
type: Class
label: gratte-ciel @fr

Axiom
annotated target: shipPropulsion
annotated source: has Company
matching quantification: 1

Axiom
matching quantification: 204
annotated source: has Military Unit
annotated target: moreUsers

radio station
type: Class
label: station de radio @fr

member of parliament
label: membre du Parlement @fr
type: Class

bone
label: os @fr
label: Knochen @de
type: Class

has Comedian
comment: Relazione tra Mean Of Transportation e Comedian @it
domain: mean of transportation
range: comedian
comment: Relation between Mean Of Transportation and Comedian
type: ObjectProperty

airport
label: aéroport @fr
label: Flughafen @de
type: Class

conifer
type: Class
label: conifères @fr

has Monarch
domain: mean of transportation
comment: Relation between Mean Of Transportation and Monarch
type: ObjectProperty
comment: Relazione tra Mean Of Transportation e Monarch @it
range: monarch

Axiom
annotated target: builder
annotated source: has Organisation
matching quantification: 91

rocket
type: Class
label: fusée @fr

disease
label: maladie @fr
type: Class

has Mayor
type: ObjectProperty
comment: Relation between Mean Of Transportation and Mayor
domain: mean of transportation
range: mayor
comment: Relazione tra Mean Of Transportation e Mayor @it

Axiom
matching quantification: 1
annotated source: has Company
annotated target: transmission

Axiom
annotated target: currentowner
annotated source: has Building
matching quantification: 3

has Fish
comment: Relation between Mean Of Transportation and Fish
comment: Relazione tra Mean Of Transportation e Fish @it
domain: mean of transportation
type: ObjectProperty
range: fish

has Wine Region
type: ObjectProperty
domain: mean of transportation
range: wine region
comment: Relation between Mean Of Transportation and Wine Region
comment: Relazione tra Mean Of Transportation e Wine Region @it

Axiom
annotated target: similar
annotated source: has Organisation
matching quantification: 1

year in spaceflight
label: année de vols spatiaux @fr
type: Class

Axiom
matching quantification: 1
annotated target: location
annotated source: has Place

american football player
label: joueur de football américain @fr
type: Class

stadium
type: Class
label: stade @fr

has Bird
type: ObjectProperty
range: bird
comment: Relazione tra Mean Of Transportation e Bird @it
comment: Relation between Mean Of Transportation and Bird
domain: mean of transportation

astronaut
type: Class
label: Astronaut @de
label: astronaute @fr

Axiom
matching quantification: 6
annotated source: has Company
annotated target: manufacturers

has Chemical Compound
comment: Relazione tra Mean Of Transportation e Chemical Compound @it
type: ObjectProperty
comment: Relation between Mean Of Transportation and Chemical Compound
range: chemical compound
domain: mean of transportation

Axiom
annotated source: has University
annotated target: currentowner
matching quantification: 1

Site of Special Scientific Interest
label: site d'intérêt scientifique particulier @fr
type: Class

has Planet
type: ObjectProperty
comment: Relation between Mean Of Transportation and Planet
comment: Relazione tra Mean Of Transportation e Planet @it
range: planet
domain: mean of transportation

mayor
label: maire @fr
type: Class

amphibian
label: amphibien @fr
type: Class

pope
type: Class
label: pape @fr

Axiom
matching quantification: 1
annotated target: assembly
annotated source: has Building

Axiom
annotated target: partof
matching quantification: 399
annotated source: has Organisation

has Protected Area
range: protected area
comment: Relazione tra Mean Of Transportation e Protected Area @it
type: ObjectProperty
comment: Relation between Mean Of Transportation and Protected Area
domain: mean of transportation

Axiom
matching quantification: 102
annotated source: has Organisation
annotated target: builders

newspaper
label: journal @fr
type: Class

protected area
type: Class
label: προστατευμένη περιοχή @el
label: aire protégée @fr

game
label: jeu @fr
type: Class

has World Heritage Site
type: ObjectProperty
comment: Relation between Mean Of Transportation and World Heritage Site
domain: mean of transportation
range: World Heritage Site
comment: Relazione tra Mean Of Transportation e World Heritage Site @it

has Space Shuttle
comment: Relation between Mean Of Transportation and Space Shuttle
domain: mean of transportation
comment: Relazione tra Mean Of Transportation e Space Shuttle @it
range: space shuttle
type: ObjectProperty

has Lighthouse
range: lighthouse
comment: Relazione tra Mean Of Transportation e Lighthouse @it
comment: Relation between Mean Of Transportation and Lighthouse
domain: mean of transportation
type: ObjectProperty

Axiom
annotated source: has Administrative Region
annotated target: shipBuilder
matching quantification: 6

has Sport
comment: Relazione tra Mean Of Transportation e Sport @it
comment: Relation between Mean Of Transportation and Sport
type: ObjectProperty
domain: mean of transportation
range: sport

has Golf Player
comment: Relazione tra Mean Of Transportation e Golf Player @it
comment: Relation between Mean Of Transportation and Golf Player
domain: mean of transportation
type: ObjectProperty
range: golf player

has Eukaryote
related match: nicknames
range: eukaryote
comment: Relation between Mean Of Transportation and Eukaryote
comment: Relazione tra Mean Of Transportation e Eukaryote @it
type: ObjectProperty
domain: mean of transportation

Axiom
annotated target: designer
annotated source: has Organisation
matching quantification: 2

language
label: langage @fr
type: Class

Axiom
annotated source: has Person
matching quantification: 3
annotated target: designer

Axiom
annotated source: has Place
matching quantification: 5
annotated target: assembly percent C2 percent A0

has Plant
type: ObjectProperty
domain: mean of transportation
comment: Relation between Mean Of Transportation and Plant
comment: Relazione tra Mean Of Transportation e Plant @it
range: plant

has Soccer Manager
type: ObjectProperty
domain: mean of transportation
range: soccer manager
comment: Relazione tra Mean Of Transportation e Soccer Manager @it
comment: Relation between Mean Of Transportation and Soccer Manager

has Basketball League
type: ObjectProperty
domain: mean of transportation
range: basketball league
comment: Relazione tra Mean Of Transportation e Basketball League @it
comment: Relation between Mean Of Transportation and Basketball League

has Christian Bishop
comment: Relation between Mean Of Transportation and Christian Bishop
domain: mean of transportation
comment: Relazione tra Mean Of Transportation e Christian Bishop @it
type: ObjectProperty
range: Christian Bishop

Axiom
annotated source: has Town
annotated target: assembly
matching quantification: 70

body of water
label: étendue d'eau @fr
type: Class

Axiom
matching quantification: 11
annotated target: assembly
annotated source: has Island

Axiom
annotated target: moreUsers
matching quantification: 28
annotated source: has Country

has Fungus
type: ObjectProperty
domain: mean of transportation
range: fungus
comment: Relation between Mean Of Transportation and Fungus
comment: Relazione tra Mean Of Transportation e Fungus @it

has Book
comment: Relazione tra Mean Of Transportation e Book @it
comment: Relation between Mean Of Transportation and Book
domain: mean of transportation
type: ObjectProperty
range: book

has Musical
domain: mean of transportation
comment: Relation between Mean Of Transportation and Musical
range: musical
type: ObjectProperty
comment: Relazione tra Mean Of Transportation e Musical @it

has Town
domain: mean of transportation
related match: assembly
comment: Relazione tra Mean Of Transportation e Town @it
range: town
comment: Relation between Mean Of Transportation and Town
related match: production
type: ObjectProperty
related match: shipLaunched
related match: shipRoute
related match: shipBuilder
related match: builders
related match: builder

Axiom
matching quantification: 75
annotated source: has Organisation
annotated target: operators

has Skyscraper
comment: Relazione tra Mean Of Transportation e Skyscraper @it
comment: Relation between Mean Of Transportation and Skyscraper
type: ObjectProperty
range: skyscraper
domain: mean of transportation

Axiom
annotated source: has Military Conflict
matching quantification: 2
annotated target: partof

river
label: rivière @fr
type: Class

Axiom
matching quantification: 619
annotated target: assembly
annotated source: has Country

country
type: Class
label: χώρα @el
label: Staat @de
label: pays @fr

school
type: Class
label: école @fr

museum
label: musée @fr
type: Class

video game
label: jeux vidéo @fr
type: Class

trade union
label: syndicat professionnel @fr
type: Class

Axiom
annotated source: has Town
annotated target: builders
matching quantification: 9

Axiom
annotated source: has Organisation
matching quantification: 1
annotated target: engines

has Astronaut
comment: Relazione tra Mean Of Transportation e Astronaut @it
domain: mean of transportation
type: ObjectProperty
comment: Relation between Mean Of Transportation and Astronaut
range: astronaut

currency
type: Class
label: devise @fr

British royalty
label: royauté Britannique @fr
type: Class

has British Royalty
range: British royalty
domain: mean of transportation
comment: Relation between Mean Of Transportation and British Royalty
type: ObjectProperty
comment: Relazione tra Mean Of Transportation e British Royalty @it

historic place
type: Class
label: site historique @fr

Axiom
annotated source: has Organisation
matching quantification: 1
annotated target: after

Axiom
annotated target: manufacturer
annotated source: has Company
matching quantification: 112

monument
type: Class

has Broadcast
range: broadcast
comment: Relazione tra Mean Of Transportation e Broadcast @it
domain: mean of transportation
type: ObjectProperty
comment: Relation between Mean Of Transportation and Broadcast

Axiom
annotated target: locale
matching quantification: 27
annotated source: has Continent

has Newspaper
comment: Relazione tra Mean Of Transportation e Newspaper @it
type: ObjectProperty
range: newspaper
domain: mean of transportation
comment: Relation between Mean Of Transportation and Newspaper

has Lunar Crater
range: lunar crater
domain: mean of transportation
comment: Relation between Mean Of Transportation and Lunar Crater
comment: Relazione tra Mean Of Transportation e Lunar Crater @it
type: ObjectProperty

Axiom
annotated target: parentCompany
annotated source: has Organisation
matching quantification: 7

continent
type: Class
label: ήπειρος @el

figure skater
label: patineur artistique @fr
type: Class

Axiom
annotated target: currentowner
matching quantification: 1
annotated source: has Company

has Continent
related match: class
related match: locale
domain: mean of transportation
comment: Relazione tra Mean Of Transportation e Continent @it
comment: Relation between Mean Of Transportation and Continent
type: ObjectProperty
range: continent

has Building
related match: sites
related match: currentowner
related match: assembly
type: ObjectProperty
range: building
domain: mean of transportation
comment: Relation between Mean Of Transportation and Building
comment: Relazione tra Mean Of Transportation e Building @it

person
label: personne @fr
label: pessoa @pt
label: Person @de
type: Class

Axiom
annotated target: assembly percent C2 percent A0
annotated source: has City
matching quantification: 1

has Village
related match: assembly
comment: Relazione tra Mean Of Transportation e Village @it
range: village
comment: Relation between Mean Of Transportation and Village
domain: mean of transportation
type: ObjectProperty

has Formula One Racer
type: ObjectProperty
range: Formula One racer
comment: Relation between Mean Of Transportation and Formula One Racer
comment: Relazione tra Mean Of Transportation e Formula One Racer @it
domain: mean of transportation

has Cardinal
range: cardinal
type: ObjectProperty
comment: Relazione tra Mean Of Transportation e Cardinal @it
comment: Relation between Mean Of Transportation and Cardinal
domain: mean of transportation

has Mountain Range
range: mountain range
comment: Relation between Mean Of Transportation and Mountain Range
domain: mean of transportation
comment: Relazione tra Mean Of Transportation e Mountain Range @it
type: ObjectProperty

canadian football team
type: Class
label: équipe canadienne de football américain @fr

music genre
type: Class
label: género musical @pt
label: genre musical @fr

has Rugby Player
domain: mean of transportation
range: rugby player
comment: Relation between Mean Of Transportation and Rugby Player
comment: Relazione tra Mean Of Transportation e Rugby Player @it
type: ObjectProperty

writer
type: Class
label: écrivain @fr

record label
type: Class
label: label discographique @fr

architect
type: Class
label: architecte @fr

Axiom
annotated source: has Rocket
annotated target: variantsWithTheirOwnArticles
matching quantification: 7

has College
type: ObjectProperty
comment: Relazione tra Mean Of Transportation e College @it
domain: mean of transportation
range: college
comment: Relation between Mean Of Transportation and College

has Writer
range: writer
comment: Relation between Mean Of Transportation and Writer
comment: Relazione tra Mean Of Transportation e Writer @it
domain: mean of transportation
type: ObjectProperty

model
type: Class
label: mannequin @fr

ambassador
label: ambassadeur @fr
type: Class

city
type: Class
label: cité @fr

has Scientist
related match: shipNamesake
type: ObjectProperty
domain: mean of transportation
range: scientist
comment: Relazione tra Mean Of Transportation e Scientist @it
comment: Relation between Mean Of Transportation and Scientist

Axiom
annotated target: location
matching quantification: 1
annotated source: has River

has Motorcycle Racing League
range: motorcycle racing league
comment: Relation between Mean Of Transportation and Motorcycle Racing League
comment: Relazione tra Mean Of Transportation e Motorcycle Racing League @it
type: ObjectProperty
domain: mean of transportation

Grand Prix
label: grand prix @fr
type: Class

has Auto Racing League
comment: Relazione tra Mean Of Transportation e Auto Racing League @it
type: ObjectProperty
comment: Relation between Mean Of Transportation and Auto Racing League
domain: mean of transportation
range: auto racing league

chancellor
label: chancelier @fr
type: Class

Axiom
matching quantification: 2
annotated source: has Automobile
annotated target: competition

comics creator
label: créateur de bandes dessinées @fr
type: Class

has Figure Skater
comment: Relazione tra Mean Of Transportation e Figure Skater @it
type: ObjectProperty
domain: mean of transportation
range: figure skater
comment: Relation between Mean Of Transportation and Figure Skater

soccer player
type: Class
label: joueur de football @fr

Axiom
annotated source: has Automobile
matching quantification: 5
annotated target: after

reptile
type: Class

Axiom
annotated target: shipRegistry
matching quantification: 2
annotated source: has Place

congressman
type: Class
label: membre du Congrès @fr

Axiom
annotated source: has Software
annotated target: format
matching quantification: 1

Axiom
annotated target: shipBuilder
matching quantification: 1
annotated source: has Person

has Bridge
domain: mean of transportation
comment: Relation between Mean Of Transportation and Bridge
comment: Relazione tra Mean Of Transportation e Bridge @it
range: bridge
type: ObjectProperty

has Website
comment: Relazione tra Mean Of Transportation e Website @it
range: website
domain: mean of transportation
type: ObjectProperty
comment: Relation between Mean Of Transportation and Website

building
label: bâtiment @fr
type: Class
label: κτίριο @el

journalist
type: Class
label: journaliste @fr

Axiom
annotated source: has Automobile
matching quantification: 1405
annotated target: related

has Chancellor
domain: mean of transportation
comment: Relation between Mean Of Transportation and Chancellor
comment: Relazione tra Mean Of Transportation e Chancellor @it
type: ObjectProperty
range: chancellor

american football team
type: Class
label: équipe américaine de football américain @fr

Axiom
matching quantification: 4
annotated target: production
annotated source: has Place

has Architect
domain: mean of transportation
range: architect
type: ObjectProperty
comment: Relation between Mean Of Transportation and Architect
comment: Relazione tra Mean Of Transportation e Architect @it

chemical compound
label: produit chimique @fr
type: Class

bird
label: oiseau @fr
type: Class

Axiom
annotated source: has City
matching quantification: 1
annotated target: locale

power station
type: Class

has Historic Place
related match: shipHomeport
domain: mean of transportation
related match: shipYardNumber
related match: railroad
related match: shipBuilder
range: historic place
type: ObjectProperty
comment: Relazione tra Mean Of Transportation e Historic Place @it
related match: builders
related match: sites
comment: Relation between Mean Of Transportation and Historic Place
related match: builder

fern
type: Class
label: fougères @fr

Axiom
annotated target: builders
matching quantification: 12
annotated source: has City

Axiom
annotated source: has Museum
matching quantification: 3
annotated target: currentowner

has President
domain: mean of transportation
range: president
type: ObjectProperty
comment: Relazione tra Mean Of Transportation e President @it
comment: Relation between Mean Of Transportation and President

fictional character
type: Class
label: personnage de fiction @fr

has Ice Hockey Player
range: ice hockey player
domain: mean of transportation
comment: Relazione tra Mean Of Transportation e Ice Hockey Player @it
comment: Relation between Mean Of Transportation and Ice Hockey Player
type: ObjectProperty

has Military Unit
related match: operators
related match: shipFlag
domain: mean of transportation
range: military unit
type: ObjectProperty
related match: shipOperator
comment: Relation between Mean Of Transportation and Military Unit
related match: moreUsers
comment: Relazione tra Mean Of Transportation e Military Unit @it
related match: shipOperators
related match: primaryUser
related match: partof

has Convention
comment: Relation between Mean Of Transportation and Convention
range: convention
comment: Relazione tra Mean Of Transportation e Convention @it
type: ObjectProperty
domain: mean of transportation

Axiom
annotated target: shipHomeport
matching quantification: 2
annotated source: has Administrative Region

spacecraft
type: Class
label: vaisseau spatial @fr

has Airline
related match: primaryUser
related match: moreUsers
domain: mean of transportation
range: airline
type: ObjectProperty
comment: Relazione tra Mean Of Transportation e Airline @it
comment: Relation between Mean Of Transportation and Airline

musical
type: Class
label: musique @fr

actor
label: acteur @fr
type: Class
label: Schauspieler @de

Axiom
annotated target: locale
annotated source: has Country
matching quantification: 61

place
label: lugar @pt
type: Class
label: lieu @fr
label: περιοχή @el

Axiom
annotated source: has Company
annotated target: shipClassSociety
matching quantification: 1

has Arachnid
range: arachnid
comment: Relation between Mean Of Transportation and Arachnid
type: ObjectProperty
comment: Relazione tra Mean Of Transportation e Arachnid @it
domain: mean of transportation

has Mammal
related match: nicknames
domain: mean of transportation
comment: Relazione tra Mean Of Transportation e Mammal @it
comment: Relation between Mean Of Transportation and Mammal
type: ObjectProperty
range: mammal

has Mountain
comment: Relation between Mean Of Transportation and Mountain
range: mountain
comment: Relazione tra Mean Of Transportation e Mountain @it
domain: mean of transportation
type: ObjectProperty

Axiom
matching quantification: 10
annotated source: has Automobile Engine
annotated target: similar

mountain
type: Class
label: montagne @fr
label: Βουνό @el

criminal
type: Class
label: criminel @fr

space shuttle
type: Class
label: navette spatiale @fr

has Airport
related match: sites
comment: Relazione tra Mean Of Transportation e Airport @it
domain: mean of transportation
type: ObjectProperty
comment: Relation between Mean Of Transportation and Airport
range: airport

comedian
type: Class
label: comédien @fr

has Television Show
range: television show
domain: mean of transportation
type: ObjectProperty
comment: Relazione tra Mean Of Transportation e Television Show @it
comment: Relation between Mean Of Transportation and Television Show

Axiom
annotated target: shipNamesake
matching quantification: 2
annotated source: has Place

has Canadian Football League
comment: Relation between Mean Of Transportation and Canadian Football League
comment: Relazione tra Mean Of Transportation e Canadian Football League @it
type: ObjectProperty
range: canadian football league
domain: mean of transportation

Axiom
annotated source: has Country
annotated target: production
matching quantification: 3

gridiron football player
type: Class
label: joueur de football américain gridiron @fr

has Stadium
comment: Relazione tra Mean Of Transportation e Stadium @it
comment: Relation between Mean Of Transportation and Stadium
type: ObjectProperty
domain: mean of transportation
range: stadium

Axiom
annotated source: has City
matching quantification: 2
annotated target: currentowner

has Canal
comment: Relation between Mean Of Transportation and Canal
range: canal
type: ObjectProperty
domain: mean of transportation
comment: Relazione tra Mean Of Transportation e Canal @it

mollusca
type: Class
label: mollusque @fr

software
type: Class
label: logiciel @fr

artist
label: Künstler @de
type: Class
label: artiste @fr

drug
label: médicament @fr
type: Class

Axiom
annotated source: has Continent
matching quantification: 1
annotated target: class

magazine
type: Class
label: περιοδικό @el

Axiom
annotated target: payloads
matching quantification: 2
annotated source: has Space Station

has University
comment: Relation between Mean Of Transportation and University
domain: mean of transportation
range: university
comment: Relazione tra Mean Of Transportation e University @it
type: ObjectProperty
related match: currentowner

Axiom
matching quantification: 1
annotated target: builder
annotated source: has Historic Place

canal
type: Class

military person
label: militaire @fr
type: Class

has Administrative Region
comment: Relazione tra Mean Of Transportation e Administrative Region @it
related match: locale
related match: shipNamesake
related match: builders
related match: assembly
type: ObjectProperty
related match: shipHomeport
comment: Relation between Mean Of Transportation and Administrative Region
range: administrative region
related match: shipBuilder
related match: builder
domain: mean of transportation

has Journalist
range: journalist
domain: mean of transportation
comment: Relazione tra Mean Of Transportation e Journalist @it
comment: Relation between Mean Of Transportation and Journalist
type: ObjectProperty

award
label: récompense @fr
type: Class

locomotive
type: Class

has Criminal
comment: Relation between Mean Of Transportation and Criminal
domain: mean of transportation
comment: Relazione tra Mean Of Transportation e Criminal @it
range: criminal
type: ObjectProperty

college
type: Class

anatomical structure
label: structure anatomique @fr
type: Class

cricketer
label: joueur de cricket @fr
type: Class

Axiom
annotated source: has Space Mission
annotated target: after
matching quantification: 1

single
type: Class

has Drug
comment: Relazione tra Mean Of Transportation e Drug @it
range: drug
domain: mean of transportation
type: ObjectProperty
comment: Relation between Mean Of Transportation and Drug

Axiom
matching quantification: 22
annotated source: has Weapon
annotated target: shipArmament

Axiom
annotated source: has Place
annotated target: shipCountry
matching quantification: 2

ethnic group
type: Class
label: groupe ethnique @fr

has Pope
domain: mean of transportation
comment: Relazione tra Mean Of Transportation e Pope @it
range: pope
comment: Relation between Mean Of Transportation and Pope
type: ObjectProperty

Axiom
annotated source: has Airline
matching quantification: 1
annotated target: primaryUser

motorcycle racing league
label: ligue de courses motocycliste @fr
type: Class

Axiom
matching quantification: 13
annotated source: has City
annotated target: shipHomeport

college coach
type: Class
label: entraîneur universitaire @fr

television episode
type: Class
label: épisode télévisé @fr

has Video Game
range: video game
type: ObjectProperty
comment: Relazione tra Mean Of Transportation e Video Game @it
domain: mean of transportation
comment: Relation between Mean Of Transportation and Video Game

Axiom
matching quantification: 1
annotated source: has Administrative Region
annotated target: shipNamesake

Axiom
annotated source: has Organisation
matching quantification: 3
annotated target: shipOperator

soccer club
type: Class
label: club de football @fr

has Park
comment: Relation between Mean Of Transportation and Park
range: park
domain: mean of transportation
type: ObjectProperty
comment: Relazione tra Mean Of Transportation e Park @it

Axiom
matching quantification: 1
annotated target: shipNamesake
annotated source: has Body Of Water

historic building
type: Class
label: bâtiment historique @fr

has Conifer
domain: mean of transportation
type: ObjectProperty
comment: Relation between Mean Of Transportation and Conifer
range: conifer
comment: Relazione tra Mean Of Transportation e Conifer @it

Axiom
matching quantification: 1
annotated target: production
annotated source: has Town

has River
comment: Relation between Mean Of Transportation and River
type: ObjectProperty
comment: Relazione tra Mean Of Transportation e River @it
domain: mean of transportation
range: river
related match: location
related match: shipNamesake

military conflict
label: conflit militaire @fr
type: Class

has Radio Station
range: radio station
type: ObjectProperty
domain: mean of transportation
comment: Relazione tra Mean Of Transportation e Radio Station @it
comment: Relation between Mean Of Transportation and Radio Station

has Museum
related match: currentowner
comment: Relazione tra Mean Of Transportation e Museum @it
range: museum
comment: Relation between Mean Of Transportation and Museum
type: ObjectProperty
domain: mean of transportation

has Hotel
type: ObjectProperty
domain: mean of transportation
comment: Relation between Mean Of Transportation and Hotel
range: hotel
comment: Relazione tra Mean Of Transportation e Hotel @it

Axiom
matching quantification: 1287
annotated source: has Place
annotated target: assembly

has Reptile
type: ObjectProperty
comment: Relation between Mean Of Transportation and Reptile
comment: Relazione tra Mean Of Transportation e Reptile @it
range: reptile
domain: mean of transportation

Axiom
annotated source: has Company
annotated target: contractors
matching quantification: 1

launch pad
type: Class
label: rampe de lancement @fr

has Comics Creator
type: ObjectProperty
comment: Relazione tra Mean Of Transportation e Comics Creator @it
domain: mean of transportation
range: comics creator
comment: Relation between Mean Of Transportation and Comics Creator

Axiom
annotated target: related
matching quantification: 1
annotated source: has Company

Axiom
matching quantification: 1
annotated target: class
annotated source: has Place

Christian Bishop
label: évêque chrétien @fr
type: Class

Axiom
annotated source: has Weapon
annotated target: shipAircraft
matching quantification: 1

mountain range
type: Class
label: chaîne de montagne @fr

has Soccer Club
domain: mean of transportation
comment: Relation between Mean Of Transportation and Soccer Club
range: soccer club
type: ObjectProperty
comment: Relazione tra Mean Of Transportation e Soccer Club @it

Axiom
annotated source: has Space Mission
annotated target: before
matching quantification: 1

animal
type: Class

sports league
type: Class
label: ligue sportive @fr

has Sports League
comment: Relazione tra Mean Of Transportation e Sports League @it
range: sports league
comment: Relation between Mean Of Transportation and Sports League
domain: mean of transportation
type: ObjectProperty

Axiom
annotated target: railroad
matching quantification: 1
annotated source: has Place

Axiom
annotated source: has City
matching quantification: 241
annotated target: assembly

Axiom
matching quantification: 1
annotated source: has Locomotive
annotated target: currentowner

organisation
label: Organisation @de
type: Class
label: organização @pt

has Race
type: ObjectProperty
comment: Relazione tra Mean Of Transportation e Race @it
range: race
comment: Relation between Mean Of Transportation and Race
domain: mean of transportation

Axiom
matching quantification: 2
annotated target: predecessors
annotated source: has Automobile

Axiom
annotated source: has Organisation
matching quantification: 58
annotated target: railroad

has Legislature
comment: Relazione tra Mean Of Transportation e Legislature @it
range: legislature
type: ObjectProperty
domain: mean of transportation
comment: Relation between Mean Of Transportation and Legislature

has Space Station
related match: after
related match: payloads
domain: mean of transportation
range: space station
comment: Relazione tra Mean Of Transportation e Space Station @it
comment: Relation between Mean Of Transportation and Space Station
type: ObjectProperty

has Place
related match: shipCountry
related match: operators
related match: manufacturer
related match: builders
related match: shipYardNumber
related match: class
domain: mean of transportation
range: place
related match: locale
related match: builder
related match: shipHomeport
related match: sites
related match: location
related match: shipRoute
type: ObjectProperty
related match: railroad
related match: currentowner
related match: shipRegistry
related match: shipNamesake
related match: moreUsers
related match: shipBuilder
related match: production
related match: assembly percent C2 percent A0
related match: assembly
comment: Relation between Mean Of Transportation and Place
related match: shipLaunched
comment: Relazione tra Mean Of Transportation e Place @it

Axiom
annotated source: has Administrative Region
matching quantification: 2
annotated target: builder

plant
type: Class
label: plante @fr

Axiom
matching quantification: 3
annotated target: shipYardNumber
annotated source: has Place

Axiom
annotated source: has Organisation
annotated target: shipOperators
matching quantification: 1

mammal
type: Class
label: mammifère @fr

Axiom
annotated source: has Military Conflict
annotated target: shipNamesake
matching quantification: 1

Eurovision song contest entry
type: Class
label: concours Eurovision de la chanson @fr

Axiom
matching quantification: 62
annotated target: sites
annotated source: has Building

Axiom
matching quantification: 1
annotated target: builder
annotated source: has Town

Axiom
annotated source: has Town
annotated target: shipLaunched
matching quantification: 1

has Tennis Player
domain: mean of transportation
type: ObjectProperty
range: tennis player
comment: Relation between Mean Of Transportation and Tennis Player
comment: Relazione tra Mean Of Transportation e Tennis Player @it

Axiom
annotated source: has Organisation
annotated target: shipClassSociety
matching quantification: 1

Axiom
annotated source: has Historic Place
matching quantification: 3
annotated target: shipYardNumber

has Governor
comment: Relation between Mean Of Transportation and Governor
comment: Relazione tra Mean Of Transportation e Governor @it
range: governor
type: ObjectProperty
domain: mean of transportation

Axiom
annotated target: primaryUser
matching quantification: 14
annotated source: has Military Unit

has Fictional Character
range: fictional character
comment: Relation between Mean Of Transportation and Fictional Character
comment: Relazione tra Mean Of Transportation e Fictional Character @it
type: ObjectProperty
domain: mean of transportation

has Election
comment: Relazione tra Mean Of Transportation e Election @it
domain: mean of transportation
comment: Relation between Mean Of Transportation and Election
type: ObjectProperty
range: Election

has Artist
range: artist
comment: Relation between Mean Of Transportation and Artist
comment: Relazione tra Mean Of Transportation e Artist @it
domain: mean of transportation
type: ObjectProperty

has Moss
range: moss
type: ObjectProperty
comment: Relazione tra Mean Of Transportation e Moss @it
domain: mean of transportation
comment: Relation between Mean Of Transportation and Moss