television show
type: Class
label: émission de télévision @fr

rocket
label: fusée @fr
type: Class

has Music Festival
type: ObjectProperty
comment: Relazione tra Military Unit e Music Festival @it
range: music festival
comment: Relation between Military Unit and Music Festival
domain: military unit

Axiom
annotated source: has President
matching quantification: 1
annotated target: allegiance

disease
type: Class
label: maladie @fr

has President
related match: notableMembers
related match: allegiance
related match: notableCommanders
comment: Relazione tra Military Unit e President @it
comment: Relation between Military Unit and President
type: ObjectProperty
range: president
domain: military unit

colour
label: χρώμα @el
label: couleur @fr
type: Class

automobile
type: Class

Election
type: Class
label: élection @fr

has Grand Prix
comment: Relazione tra Military Unit e Grand Prix @it
range: Grand Prix
domain: military unit
comment: Relation between Military Unit and Grand Prix
type: ObjectProperty

has Musical Artist
domain: military unit
range: musical artist
comment: Relazione tra Military Unit e Musical Artist @it
comment: Relation between Military Unit and Musical Artist
type: ObjectProperty

has Comics Character
comment: Relation between Military Unit and Comics Character
comment: Relazione tra Military Unit e Comics Character @it
range: comics character
type: ObjectProperty
domain: military unit

american football player
type: Class
label: joueur de football américain @fr

has Mountain
type: ObjectProperty
domain: military unit
comment: Relation between Military Unit and Mountain
range: mountain
comment: Relazione tra Military Unit e Mountain @it
related match: battles

stadium
label: stade @fr
type: Class

has River
related match: battleHonours
related match: battles
range: river
domain: military unit
comment: Relazione tra Military Unit e River @it
comment: Relation between Military Unit and River
type: ObjectProperty

soccer league
label: ligue de football @fr
type: Class

has Reptile
domain: military unit
comment: Relazione tra Military Unit e Reptile @it
type: ObjectProperty
range: reptile
comment: Relation between Military Unit and Reptile

astronaut
type: Class
label: Astronaut @de
label: astronaute @fr

wrestler
label: lutteur @fr
type: Class

mayor
type: Class
label: maire @fr

has Amphibian
type: ObjectProperty
comment: Relation between Military Unit and Amphibian
domain: military unit
range: amphibian
comment: Relazione tra Military Unit e Amphibian @it

Axiom
matching quantification: 1
annotated source: has Historic Place
annotated target: garrison

amphibian
label: amphibien @fr
type: Class

pope
type: Class
label: pape @fr

has Olympics
range: olympics
comment: Relation between Military Unit and Olympics
comment: Relazione tra Military Unit e Olympics @it
domain: military unit
type: ObjectProperty

has Airline
type: ObjectProperty
comment: Relation between Military Unit and Airline
domain: military unit
comment: Relazione tra Military Unit e Airline @it
range: airline

Axiom
matching quantification: 2
annotated source: has Historic Place
annotated target: battles

newspaper
label: journal @fr
type: Class

game
type: Class
label: jeu @fr

protected area
label: aire protégée @fr
label: προστατευμένη περιοχή @el
type: Class

road
label: route @fr
type: Class

boxer
type: Class
label: boxeur @fr

judge
type: Class
label: juge @fr

World Heritage Site
label: site du patrimoine mondial @fr
type: Class

has Cricketer
range: cricketer
type: ObjectProperty
comment: Relazione tra Military Unit e Cricketer @it
domain: military unit
comment: Relation between Military Unit and Cricketer

has School
comment: Relazione tra Military Unit e School @it
comment: Relation between Military Unit and School
range: school
type: ObjectProperty
domain: military unit

has Christian Bishop
type: ObjectProperty
domain: military unit
range: Christian Bishop
comment: Relazione tra Military Unit e Christian Bishop @it
comment: Relation between Military Unit and Christian Bishop

station
type: Class

language
type: Class
label: langage @fr

Axiom
matching quantification: 1
annotated target: battleHonours
annotated source: has Protected Area

lake
label: lac @fr
type: Class

Axiom
annotated target: ceremonialChief
annotated source: has British Royalty
matching quantification: 9

arachnid
label: arachnides @fr
type: Class

governor
type: Class
label: gouverneur @fr

has British Royalty
related match: notableCommanders
comment: Relation between Military Unit and British Royalty
domain: military unit
related match: commander
type: ObjectProperty
comment: Relazione tra Military Unit e British Royalty @it
related match: ceremonialChief
range: British royalty
related match: colonelOfTheRegiment

Axiom
matching quantification: 1
annotated source: has World Heritage Site
annotated target: battleHonours

river
type: Class
label: rivière @fr

school
label: école @fr
type: Class

ship
type: Class
label: navire @fr

museum
label: musée @fr
type: Class

fish
type: Class
label: poisson @fr

has Supreme Court Of The United States Case
range: Supreme Court of the United States case
comment: Relation between Military Unit and Supreme Court Of The United States Case
domain: military unit
comment: Relazione tra Military Unit e Supreme Court Of The United States Case @it
type: ObjectProperty

tennis player
type: Class
label: joueur de tennis @fr

has Hockey Team
comment: Relation between Military Unit and Hockey Team
type: ObjectProperty
domain: military unit
comment: Relazione tra Military Unit e Hockey Team @it
range: hockey team

video game
type: Class
label: jeux vidéo @fr

trade union
type: Class
label: syndicat professionnel @fr

has Rocket
range: rocket
comment: Relation between Military Unit and Rocket
comment: Relazione tra Military Unit e Rocket @it
type: ObjectProperty
domain: military unit

has Wrestler
type: ObjectProperty
comment: Relazione tra Military Unit e Wrestler @it
comment: Relation between Military Unit and Wrestler
range: wrestler
domain: military unit

currency
label: devise @fr
type: Class

prime minister
type: Class
label: premier ministre @fr

British royalty
label: royauté Britannique @fr
type: Class

has Trade Union
domain: military unit
range: trade union
comment: Relazione tra Military Unit e Trade Union @it
type: ObjectProperty
comment: Relation between Military Unit and Trade Union

Axiom
annotated source: has Colour
matching quantification: 1
annotated target: colors

race
label: course @fr
type: Class

historic place
label: site historique @fr
type: Class

hospital
type: Class
label: hôpital @fr

has Road
domain: military unit
type: ObjectProperty
comment: Relazione tra Military Unit e Road @it
range: road
comment: Relation between Military Unit and Road

Axiom
annotated target: commander
annotated source: has British Royalty
matching quantification: 1

has Adult Actor
type: ObjectProperty
domain: military unit
range: adult actor
comment: Relazione tra Military Unit e Adult Actor @it
comment: Relation between Military Unit and Adult Actor

has Soccer Club
range: soccer club
comment: Relation between Military Unit and Soccer Club
comment: Relazione tra Military Unit e Soccer Club @it
type: ObjectProperty
domain: military unit

has Museum
comment: Relation between Military Unit and Museum
type: ObjectProperty
domain: military unit
comment: Relazione tra Military Unit e Museum @it
range: museum

has Broadcast
comment: Relation between Military Unit and Broadcast
range: broadcast
type: ObjectProperty
domain: military unit
comment: Relazione tra Military Unit e Broadcast @it

has Boxer
comment: Relation between Military Unit and Boxer
type: ObjectProperty
comment: Relazione tra Military Unit e Boxer @it
range: boxer
domain: military unit

has Scientist
comment: Relation between Military Unit and Scientist
comment: Relazione tra Military Unit e Scientist @it
range: scientist
type: ObjectProperty
domain: military unit

has Ethnic Group
range: ethnic group
domain: military unit
type: ObjectProperty
comment: Relation between Military Unit and Ethnic Group
comment: Relazione tra Military Unit e Ethnic Group @it

has Book
comment: Relazione tra Military Unit e Book @it
domain: military unit
comment: Relation between Military Unit and Book
range: book
type: ObjectProperty

continent
type: Class
label: ήπειρος @el

president
type: Class
label: président @fr

album
label: Album @de
type: Class

has Station
type: ObjectProperty
domain: military unit
comment: Relation between Military Unit and Station
range: station
comment: Relazione tra Military Unit e Station @it

has Journalist
type: ObjectProperty
comment: Relation between Military Unit and Journalist
comment: Relazione tra Military Unit e Journalist @it
range: journalist
domain: military unit

military unit
label: unité militaire @fr
type: Class

has Monarch
related match: notableCommanders
domain: military unit
type: ObjectProperty
comment: Relazione tra Military Unit e Monarch @it
range: monarch
comment: Relation between Military Unit and Monarch

Axiom
annotated source: has Prime Minister
matching quantification: 5
annotated target: notableCommanders

soccer manager
type: Class
label: entraîneur de football @fr

has American Football Player
range: american football player
type: ObjectProperty
comment: Relazione tra Military Unit e American Football Player @it
comment: Relation between Military Unit and American Football Player
domain: military unit

basketball team
type: Class

has Song
comment: Relation between Military Unit and Song
type: ObjectProperty
range: song
domain: military unit
comment: Relazione tra Military Unit e Song @it

music genre
type: Class
label: género musical @pt
label: genre musical @fr

writer
label: écrivain @fr
type: Class

has University
range: university
comment: Relation between Military Unit and University
comment: Relazione tra Military Unit e University @it
domain: military unit
type: ObjectProperty

has Historic Place
domain: military unit
type: ObjectProperty
comment: Relation between Military Unit and Historic Place
range: historic place
comment: Relazione tra Military Unit e Historic Place @it
related match: battles
related match: garrison

has Stadium
comment: Relation between Military Unit and Stadium
domain: military unit
type: ObjectProperty
comment: Relazione tra Military Unit e Stadium @it
range: stadium
related match: battles

architect
label: architecte @fr
type: Class

ambassador
type: Class
label: ambassadeur @fr

has Comics Creator
range: comics creator
comment: Relazione tra Military Unit e Comics Creator @it
comment: Relation between Military Unit and Comics Creator
domain: military unit
type: ObjectProperty

has Single
comment: Relation between Military Unit and Single
range: single
type: ObjectProperty
comment: Relazione tra Military Unit e Single @it
domain: military unit

film festival
type: Class
label: festival du film @fr

Axiom
annotated target: notableCommanders
annotated source: has President
matching quantification: 17

has Conifer
range: conifer
domain: military unit
comment: Relation between Military Unit and Conifer
comment: Relazione tra Military Unit e Conifer @it
type: ObjectProperty

Axiom
matching quantification: 1
annotated target: battles
annotated source: has Mountain

has Film
comment: Relation between Military Unit and Film
type: ObjectProperty
domain: military unit
range: film
comment: Relazione tra Military Unit e Film @it

has Mayor
type: ObjectProperty
comment: Relation between Military Unit and Mayor
range: mayor
comment: Relazione tra Military Unit e Mayor @it
domain: military unit

has American Football Team
range: american football team
type: ObjectProperty
comment: Relazione tra Military Unit e American Football Team @it
comment: Relation between Military Unit and American Football Team
domain: military unit

Grand Prix
label: grand prix @fr
type: Class

lighthouse
label: phare @fr
type: Class

has Green Alga
range: green alga
type: ObjectProperty
comment: Relation between Military Unit and Green Alga
domain: military unit
comment: Relazione tra Military Unit e Green Alga @it

chancellor
type: Class
label: chancelier @fr

has Hotel
related match: garrison
domain: military unit
type: ObjectProperty
comment: Relazione tra Military Unit e Hotel @it
comment: Relation between Military Unit and Hotel
range: hotel

comics creator
label: créateur de bandes dessinées @fr
type: Class

has Canal
type: ObjectProperty
range: canal
comment: Relation between Military Unit and Canal
domain: military unit
comment: Relazione tra Military Unit e Canal @it

has Website
comment: Relation between Military Unit and Website
range: website
domain: military unit
comment: Relazione tra Military Unit e Website @it
type: ObjectProperty

hockey team
type: Class
label: équipe de hockey @fr

soccer player
label: joueur de football @fr
type: Class

has Television Show
comment: Relazione tra Military Unit e Television Show @it
type: ObjectProperty
comment: Relation between Military Unit and Television Show
domain: military unit
range: television show

reptile
type: Class

legislature
type: Class
label: pouvoir législatif @fr

Ontology
extracted from: en.wikipedia.org
has author: Valentina Presutti
has author: Aldo Gangemi
comment: MilitaryUnit Encyclopedic Knowledge Pattern
has author: Andrea Giovanni Nuzzolese
imports: cpannotationschema.owl
extracted from: dbpedia.org
has intent: To represent the encyclopedic knowledge expressed by an object typed as MilitaryUnit

has College Coach
type: ObjectProperty
domain: military unit
comment: Relation between Military Unit and College Coach
comment: Relazione tra Military Unit e College Coach @it
range: college coach

has Senator
domain: military unit
type: ObjectProperty
range: senator
comment: Relazione tra Military Unit e Senator @it
comment: Relation between Military Unit and Senator
related match: notableCommanders

has Ice Hockey League
comment: Relazione tra Military Unit e Ice Hockey League @it
range: ice hockey league
domain: military unit
type: ObjectProperty
comment: Relation between Military Unit and Ice Hockey League

airline
type: Class
label: compagnie aérienne @fr

monarch
label: monarque @fr
type: Class

congressman
type: Class
label: membre du Congrès @fr

golf player
type: Class
label: golfeur @fr

nascar driver
type: Class
label: pilote de la nascar @fr

space mission
label: mission spatiale @fr
label: διαστημική αποστολή @el
type: Class

journalist
label: journaliste @fr
type: Class

insect
label: insecte @fr
type: Class

film
label: ταινία @el
type: Class

has Golf Player
comment: Relazione tra Military Unit e Golf Player @it
range: golf player
domain: military unit
comment: Relation between Military Unit and Golf Player
type: ObjectProperty

american football team
type: Class
label: équipe américaine de football américain @fr

Supreme Court of the United States case
type: Class
label: cas juridique de la Cour suprême des États-Unis @fr

has Musical
range: musical
domain: military unit
comment: Relazione tra Military Unit e Musical @it
comment: Relation between Military Unit and Musical
type: ObjectProperty

bird
label: oiseau @fr
type: Class

has Beverage
domain: military unit
comment: Relation between Military Unit and Beverage
type: ObjectProperty
comment: Relazione tra Military Unit e Beverage @it
range: beverage

chemical compound
label: produit chimique @fr
type: Class

Gaelic games player
label: joueur de sports gaéliques @fr
type: Class

Axiom
annotated source: has Office Holder
matching quantification: 23
annotated target: notableCommanders

has Ship
domain: military unit
type: ObjectProperty
range: ship
comment: Relation between Military Unit and Ship
comment: Relazione tra Military Unit e Ship @it
related match: equipment

has Award
domain: military unit
range: award
comment: Relation between Military Unit and Award
comment: Relazione tra Military Unit e Award @it
type: ObjectProperty

has Colour
related match: colors
type: ObjectProperty
range: colour
comment: Relazione tra Military Unit e Colour @it
domain: military unit
comment: Relation between Military Unit and Colour

fern
type: Class
label: fougères @fr

fungus
label: fungi @fr
type: Class

musical artist
label: artista musical @pt
type: Class
label: musicien @fr

has Video Game
range: video game
comment: Relation between Military Unit and Video Game
comment: Relazione tra Military Unit e Video Game @it
type: ObjectProperty
domain: military unit

park
label: parc @fr
type: Class

cardinal
type: Class

rugby player
type: Class
label: joueur de rugby @fr

american football league
type: Class

has Astronaut
domain: military unit
type: ObjectProperty
comment: Relazione tra Military Unit e Astronaut @it
range: astronaut
comment: Relation between Military Unit and Astronaut

musical
label: musique @fr
type: Class

has Baseball Player
comment: Relation between Military Unit and Baseball Player
type: ObjectProperty
comment: Relazione tra Military Unit e Baseball Player @it
range: baseball player
domain: military unit

has Congressman
comment: Relazione tra Military Unit e Congressman @it
domain: military unit
range: congressman
type: ObjectProperty
comment: Relation between Military Unit and Congressman

Axiom
matching quantification: 9
annotated source: has Governor
annotated target: commander

has Fungus
type: ObjectProperty
comment: Relation between Military Unit and Fungus
range: fungus
domain: military unit
comment: Relazione tra Military Unit e Fungus @it

has Soccer League
domain: military unit
type: ObjectProperty
comment: Relation between Military Unit and Soccer League
range: soccer league
comment: Relazione tra Military Unit e Soccer League @it

has Space Station
range: space station
domain: military unit
comment: Relation between Military Unit and Space Station
comment: Relazione tra Military Unit e Space Station @it
type: ObjectProperty

mountain
label: Βουνό @el
label: montagne @fr
type: Class

has Philosopher
range: philosopher
comment: Relation between Military Unit and Philosopher
comment: Relazione tra Military Unit e Philosopher @it
type: ObjectProperty
domain: military unit

has Anatomical Structure
range: anatomical structure
type: ObjectProperty
comment: Relazione tra Military Unit e Anatomical Structure @it
domain: military unit
comment: Relation between Military Unit and Anatomical Structure

has Insect
comment: Relazione tra Military Unit e Insect @it
range: insect
type: ObjectProperty
comment: Relation between Military Unit and Insect
domain: military unit

has Tennis Player
comment: Relazione tra Military Unit e Tennis Player @it
comment: Relation between Military Unit and Tennis Player
range: tennis player
domain: military unit
type: ObjectProperty

criminal
type: Class
label: criminel @fr

space shuttle
type: Class
label: navette spatiale @fr

has Lake
comment: Relation between Military Unit and Lake
type: ObjectProperty
range: lake
comment: Relazione tra Military Unit e Lake @it
domain: military unit

has Hospital
type: ObjectProperty
range: hospital
comment: Relation between Military Unit and Hospital
domain: military unit
comment: Relazione tra Military Unit e Hospital @it

senator
label: sénateur @fr
type: Class

saint
type: Class

has Ice Hockey Player
type: ObjectProperty
domain: military unit
comment: Relazione tra Military Unit e Ice Hockey Player @it
range: ice hockey player
comment: Relation between Military Unit and Ice Hockey Player

comedian
label: comédien @fr
type: Class

valley
label: vallée @fr
type: Class

has Skyscraper
domain: military unit
comment: Relazione tra Military Unit e Skyscraper @it
type: ObjectProperty
range: skyscraper
comment: Relation between Military Unit and Skyscraper

song
type: Class
label: chanson @fr

green alga
label: algue verte @fr
type: Class

has Baseball League
type: ObjectProperty
comment: Relation between Military Unit and Baseball League
comment: Relazione tra Military Unit e Baseball League @it
range: baseball league
domain: military unit

has Film Festival
type: ObjectProperty
domain: military unit
comment: Relation between Military Unit and Film Festival
range: film festival
comment: Relazione tra Military Unit e Film Festival @it

has Architect
range: architect
domain: military unit
comment: Relazione tra Military Unit e Architect @it
comment: Relation between Military Unit and Architect
type: ObjectProperty

Axiom
annotated target: battles
annotated source: has Protected Area
matching quantification: 2

has Arachnid
comment: Relation between Military Unit and Arachnid
domain: military unit
comment: Relazione tra Military Unit e Arachnid @it
range: arachnid
type: ObjectProperty

has Continent
domain: military unit
type: ObjectProperty
comment: Relazione tra Military Unit e Continent @it
comment: Relation between Military Unit and Continent
range: continent

has Park
domain: military unit
type: ObjectProperty
range: park
comment: Relazione tra Military Unit e Park @it
comment: Relation between Military Unit and Park

book
type: Class
label: livre @fr
label: βιβλίο @el
label: książka @pl
label: llibre @ca

has Chancellor
domain: military unit
comment: Relation between Military Unit and Chancellor
comment: Relazione tra Military Unit e Chancellor @it
type: ObjectProperty
range: chancellor

has Soccer Manager
domain: military unit
comment: Relation between Military Unit and Soccer Manager
comment: Relazione tra Military Unit e Soccer Manager @it
range: soccer manager
type: ObjectProperty

ski area
label: domaine skiable @fr
type: Class

Axiom
annotated target: battles
annotated source: has Stadium
matching quantification: 1

non-profit organisation
type: Class
label: organisation à but non lucratif @fr

space station
type: Class
label: station spatiale @fr

has Village
type: ObjectProperty
comment: Relazione tra Military Unit e Village @it
range: village
comment: Relation between Military Unit and Village
domain: military unit
related match: garrison

has Election
range: Election
domain: military unit
type: ObjectProperty
comment: Relazione tra Military Unit e Election @it
comment: Relation between Military Unit and Election

mollusca
type: Class
label: mollusque @fr

has Locomotive
domain: military unit
range: locomotive
comment: Relazione tra Military Unit e Locomotive @it
comment: Relation between Military Unit and Locomotive
type: ObjectProperty

has Mountain Range
type: ObjectProperty
domain: military unit
comment: Relation between Military Unit and Mountain Range
range: mountain range
comment: Relazione tra Military Unit e Mountain Range @it

has Legislature
range: legislature
type: ObjectProperty
comment: Relazione tra Military Unit e Legislature @it
comment: Relation between Military Unit and Legislature
domain: military unit

has Lighthouse
comment: Relation between Military Unit and Lighthouse
comment: Relazione tra Military Unit e Lighthouse @it
type: ObjectProperty
domain: military unit
range: lighthouse

has Basketball Player
type: ObjectProperty
comment: Relation between Military Unit and Basketball Player
range: basketball player
comment: Relazione tra Military Unit e Basketball Player @it
domain: military unit

drug
type: Class
label: médicament @fr

has Writer
range: writer
domain: military unit
type: ObjectProperty
comment: Relation between Military Unit and Writer
comment: Relazione tra Military Unit e Writer @it

has Music Genre
type: ObjectProperty
comment: Relation between Military Unit and Music Genre
comment: Relazione tra Military Unit e Music Genre @it
domain: military unit
range: music genre

magazine
type: Class
label: περιοδικό @el

canal
type: Class

has Radio Station
type: ObjectProperty
comment: Relazione tra Military Unit e Radio Station @it
domain: military unit
comment: Relation between Military Unit and Radio Station
range: radio station

has American Football League
domain: military unit
range: american football league
type: ObjectProperty
comment: Relazione tra Military Unit e American Football League @it
comment: Relation between Military Unit and American Football League

philosopher
label: philosophe @fr
type: Class

award
type: Class
label: récompense @fr

locomotive
type: Class

has Pope
type: ObjectProperty
comment: Relation between Military Unit and Pope
domain: military unit
comment: Relazione tra Military Unit e Pope @it
range: pope

has Album
domain: military unit
range: album
comment: Relazione tra Military Unit e Album @it
comment: Relation between Military Unit and Album
type: ObjectProperty

anatomical structure
type: Class
label: structure anatomique @fr

sport
type: Class

has Planet
comment: Relazione tra Military Unit e Planet @it
comment: Relation between Military Unit and Planet
type: ObjectProperty
range: planet
domain: military unit

cricketer
label: joueur de cricket @fr
type: Class

single
type: Class

Band
label: banda @pt
label: Musikgruppe @de
type: Class
label: groupe de musique @fr

university
label: πανεπιστήμιο @el
label: université @fr
type: Class

has Disease
range: disease
comment: Relazione tra Military Unit e Disease @it
domain: military unit
type: ObjectProperty
comment: Relation between Military Unit and Disease

ethnic group
type: Class
label: groupe ethnique @fr

has Game
domain: military unit
comment: Relation between Military Unit and Game
type: ObjectProperty
comment: Relazione tra Military Unit e Game @it
range: game

has Grape
domain: military unit
range: grape
type: ObjectProperty
comment: Relation between Military Unit and Grape
comment: Relazione tra Military Unit e Grape @it

Axiom
matching quantification: 4
annotated target: notableCommanders
annotated source: has British Royalty

has Governor
comment: Relazione tra Military Unit e Governor @it
domain: military unit
type: ObjectProperty
range: governor
comment: Relation between Military Unit and Governor
related match: notableCommanders
related match: colonelOfTheRegiment
related match: commander

has Mammal
domain: military unit
type: ObjectProperty
range: mammal
comment: Relazione tra Military Unit e Mammal @it
comment: Relation between Military Unit and Mammal

has Drug
comment: Relazione tra Military Unit e Drug @it
type: ObjectProperty
range: drug
domain: military unit
comment: Relation between Military Unit and Drug

hotel
type: Class
label: hôtel @fr

has Prime Minister
related match: notableCommanders
comment: Relazione tra Military Unit e Prime Minister @it
domain: military unit
range: prime minister
type: ObjectProperty
comment: Relation between Military Unit and Prime Minister

Axiom
annotated source: has Governor
annotated target: colonelOfTheRegiment
matching quantification: 1

has Bridge
range: bridge
domain: military unit
comment: Relazione tra Military Unit e Bridge @it
comment: Relation between Military Unit and Bridge
type: ObjectProperty

music festival
type: Class
label: festival de musique @fr

has Rugby Player
domain: military unit
comment: Relation between Military Unit and Rugby Player
range: rugby player
type: ObjectProperty
comment: Relazione tra Military Unit e Rugby Player @it

Axiom
matching quantification: 36
annotated target: commander
annotated source: has Office Holder

college coach
label: entraîneur universitaire @fr
type: Class

television episode
type: Class
label: épisode télévisé @fr

has Office Holder
range: office holder
comment: Relation between Military Unit and Office Holder
type: ObjectProperty
comment: Relazione tra Military Unit e Office Holder @it
domain: military unit
related match: commander
related match: notableCommanders

village
label: χωριό @el
type: Class

ice hockey league
label: ligue d'hockey sur glace @fr
type: Class

has Member Of Parliament
comment: Relation between Military Unit and Member Of Parliament
range: member of parliament
type: ObjectProperty
domain: military unit
comment: Relazione tra Military Unit e Member Of Parliament @it

soccer club
type: Class
label: club de football @fr

has Cardinal
comment: Relazione tra Military Unit e Cardinal @it
range: cardinal
type: ObjectProperty
domain: military unit
comment: Relation between Military Unit and Cardinal

has Nascar Driver
comment: Relation between Military Unit and Nascar Driver
comment: Relazione tra Military Unit e Nascar Driver @it
range: nascar driver
domain: military unit
type: ObjectProperty

historic building
label: bâtiment historique @fr
type: Class

baseball player
type: Class
label: joueur de baseball @fr

office holder
label: titulaire @fr
label: Amtsinhaber @de
type: Class

has Newspaper
range: newspaper
comment: Relazione tra Military Unit e Newspaper @it
type: ObjectProperty
domain: military unit
comment: Relation between Military Unit and Newspaper

website
type: Class
label: Ιστότοπος @el
label: site web @fr

grape
type: Class
label: raisin @fr

has Bird
type: ObjectProperty
comment: Relazione tra Military Unit e Bird @it
range: bird
domain: military unit
comment: Relation between Military Unit and Bird

has Band
range: Band
comment: Relazione tra Military Unit e Band @it
domain: military unit
comment: Relation between Military Unit and Band
type: ObjectProperty

Axiom
annotated target: battles
annotated source: has River
matching quantification: 8

has Saint
domain: military unit
comment: Relazione tra Military Unit e Saint @it
range: saint
type: ObjectProperty
comment: Relation between Military Unit and Saint

basketball player
label: joueur de basketball @fr
type: Class

adult actor
label: erwachsener Schauspieler @de
type: Class
label: acteur adulte @fr

Axiom
matching quantification: 1
annotated target: garrison
annotated source: has Hotel

Axiom
annotated source: has Governor
annotated target: notableCommanders
matching quantification: 4

ice hockey player
label: joueur de hockey sur glace @fr
type: Class

has Currency
comment: Relation between Military Unit and Currency
type: ObjectProperty
range: currency
comment: Relazione tra Military Unit e Currency @it
domain: military unit

has Ambassador
type: ObjectProperty
comment: Relazione tra Military Unit e Ambassador @it
comment: Relation between Military Unit and Ambassador
range: ambassador
domain: military unit

has Automobile
type: ObjectProperty
comment: Relazione tra Military Unit e Automobile @it
comment: Relation between Military Unit and Automobile
domain: military unit
range: automobile

has Fish
comment: Relation between Military Unit and Fish
domain: military unit
range: fish
comment: Relazione tra Military Unit e Fish @it
type: ObjectProperty

has Space Mission
comment: Relazione tra Military Unit e Space Mission @it
comment: Relation between Military Unit and Space Mission
domain: military unit
type: ObjectProperty
range: space mission

mountain range
label: chaîne de montagne @fr
type: Class

Christian Bishop
label: évêque chrétien @fr
type: Class

beverage
type: Class
label: boisson @fr

has Space Shuttle
comment: Relazione tra Military Unit e Space Shuttle @it
domain: military unit
comment: Relation between Military Unit and Space Shuttle
type: ObjectProperty
range: space shuttle

has Fern
domain: military unit
comment: Relation between Military Unit and Fern
comment: Relazione tra Military Unit e Fern @it
range: fern
type: ObjectProperty

has Criminal
domain: military unit
type: ObjectProperty
comment: Relazione tra Military Unit e Criminal @it
range: criminal
comment: Relation between Military Unit and Criminal

has Valley
comment: Relazione tra Military Unit e Valley @it
comment: Relation between Military Unit and Valley
domain: military unit
range: valley
type: ObjectProperty

planet
label: planète @fr
type: Class

has Mollusca
comment: Relation between Military Unit and Mollusca
range: mollusca
comment: Relazione tra Military Unit e Mollusca @it
domain: military unit
type: ObjectProperty

has Chemical Compound
domain: military unit
comment: Relazione tra Military Unit e Chemical Compound @it
range: chemical compound
comment: Relation between Military Unit and Chemical Compound
type: ObjectProperty

has Soccer Player
comment: Relation between Military Unit and Soccer Player
range: soccer player
comment: Relazione tra Military Unit e Soccer Player @it
type: ObjectProperty
domain: military unit

scientist
label: Wissenschaftler @de
type: Class
label: scientifique @fr

Axiom
matching quantification: 2
annotated source: has River
annotated target: battleHonours

Axiom
annotated target: notableCommanders
matching quantification: 2
annotated source: has Senator

has Gaelic Games Player
comment: Relation between Military Unit and Gaelic Games Player
type: ObjectProperty
comment: Relazione tra Military Unit e Gaelic Games Player @it
domain: military unit
range: Gaelic games player

Axiom
annotated target: garrison
matching quantification: 3
annotated source: has Village

olympics
type: Class
label: Jeux Olympiques @fr

has World Heritage Site
related match: battleHonours
type: ObjectProperty
domain: military unit
range: World Heritage Site
comment: Relazione tra Military Unit e World Heritage Site @it
comment: Relation between Military Unit and World Heritage Site

baseball league
type: Class
label: ligue de baseball @fr

bridge
label: pont @fr
type: Class

has Race
comment: Relazione tra Military Unit e Race @it
range: race
comment: Relation between Military Unit and Race
domain: military unit
type: ObjectProperty

broadcast
type: Class
label: Émission de télévision @fr

has Non- Profit Organisation
type: ObjectProperty
domain: military unit
comment: Relation between Military Unit and Non- Profit Organisation
range: non-profit organisation
comment: Relazione tra Military Unit e Non- Profit Organisation @it

has Comedian
comment: Relazione tra Military Unit e Comedian @it
type: ObjectProperty
range: comedian
domain: military unit
comment: Relation between Military Unit and Comedian

has Television Episode
domain: military unit
comment: Relazione tra Military Unit e Television Episode @it
type: ObjectProperty
range: television episode
comment: Relation between Military Unit and Television Episode

mammal
type: Class
label: mammifère @fr

has Historic Building
comment: Relation between Military Unit and Historic Building
range: historic building
domain: military unit
comment: Relazione tra Military Unit e Historic Building @it
type: ObjectProperty

has Language
comment: Relazione tra Military Unit e Language @it
type: ObjectProperty
comment: Relation between Military Unit and Language
range: language
domain: military unit

Axiom
matching quantification: 1
annotated source: has Ship
annotated target: equipment

comics character
type: Class
label: personnage de bandes dessinées @fr

has Judge
comment: Relation between Military Unit and Judge
type: ObjectProperty
range: judge
domain: military unit
comment: Relazione tra Military Unit e Judge @it

Axiom
annotated target: colonelOfTheRegiment
annotated source: has British Royalty
matching quantification: 1

skyscraper
type: Class
label: gratte-ciel @fr

has Protected Area
type: ObjectProperty
comment: Relazione tra Military Unit e Protected Area @it
comment: Relation between Military Unit and Protected Area
range: protected area
domain: military unit
related match: battles
related match: battleHonours

Axiom
matching quantification: 1
annotated target: notableMembers
annotated source: has President

Axiom
annotated target: notableCommanders
matching quantification: 5
annotated source: has Monarch

has Sport
domain: military unit
comment: Relation between Military Unit and Sport
comment: Relazione tra Military Unit e Sport @it
range: sport
type: ObjectProperty

radio station
type: Class
label: station de radio @fr

member of parliament
type: Class
label: membre du Parlement @fr

has Magazine
type: ObjectProperty
comment: Relation between Military Unit and Magazine
domain: military unit
range: magazine
comment: Relazione tra Military Unit e Magazine @it

has Ski Area
comment: Relation between Military Unit and Ski Area
comment: Relazione tra Military Unit e Ski Area @it
type: ObjectProperty
domain: military unit
range: ski area

has Basketball Team
comment: Relation between Military Unit and Basketball Team
range: basketball team
comment: Relazione tra Military Unit e Basketball Team @it
domain: military unit
type: ObjectProperty

conifer
label: conifères @fr
type: Class