has Disease
domain: mountain range
range: disease
type: ObjectProperty
comment: Relation between Mountain Range and Disease
comment: Relazione tra Mountain Range e Disease @it

has Ginkgo
comment: Relation between Mountain Range and Ginkgo
domain: mountain range
type: ObjectProperty
comment: Relazione tra Mountain Range e Ginkgo @it
range: ginkgo

Ontology
has author: Andrea Giovanni Nuzzolese
has author: Aldo Gangemi
extracted from: en.wikipedia.org
has intent: To represent the encyclopedic knowledge expressed by an object typed as MountainRange
extracted from: dbpedia.org
imports: cpannotationschema.owl
comment: MountainRange Encyclopedic Knowledge Pattern
has author: Valentina Presutti

television show
type: Class
label: émission de télévision @fr

has Mollusca
range: mollusca
comment: Relation between Mountain Range and Mollusca
comment: Relazione tra Mountain Range e Mollusca @it
domain: mountain range
type: ObjectProperty

park
type: Class
label: parc @fr

disease
label: maladie @fr
type: Class

has Comics Creator
range: comics creator
comment: Relazione tra Mountain Range e Comics Creator @it
comment: Relation between Mountain Range and Comics Creator
type: ObjectProperty
domain: mountain range

has Writer
range: writer
comment: Relation between Mountain Range and Writer
comment: Relazione tra Mountain Range e Writer @it
type: ObjectProperty
domain: mountain range

has Legislature
type: ObjectProperty
comment: Relazione tra Mountain Range e Legislature @it
domain: mountain range
range: legislature
comment: Relation between Mountain Range and Legislature

colour
label: χρώμα @el
label: couleur @fr
type: Class

has Reptile
range: reptile
comment: Relation between Mountain Range and Reptile
type: ObjectProperty
domain: mountain range
comment: Relazione tra Mountain Range e Reptile @it

musical
label: musique @fr
type: Class

has Park
range: park
comment: Relazione tra Mountain Range e Park @it
type: ObjectProperty
comment: Relation between Mountain Range and Park
domain: mountain range

actor
label: acteur @fr
type: Class
label: Schauspieler @de

has Airline
comment: Relation between Mountain Range and Airline
range: airline
domain: mountain range
comment: Relazione tra Mountain Range e Airline @it
type: ObjectProperty

american football player
label: joueur de football américain @fr
type: Class

has Criminal
comment: Relation between Mountain Range and Criminal
comment: Relazione tra Mountain Range e Criminal @it
type: ObjectProperty
domain: mountain range
range: criminal

has World Heritage Site
comment: Relation between Mountain Range and World Heritage Site
domain: mountain range
type: ObjectProperty
comment: Relazione tra Mountain Range e World Heritage Site @it
range: World Heritage Site

has Lighthouse
comment: Relation between Mountain Range and Lighthouse
range: lighthouse
type: ObjectProperty
comment: Relazione tra Mountain Range e Lighthouse @it
domain: mountain range

has Mammal
comment: Relazione tra Mountain Range e Mammal @it
type: ObjectProperty
comment: Relation between Mountain Range and Mammal
domain: mountain range
range: mammal

has Planet
comment: Relazione tra Mountain Range e Planet @it
comment: Relation between Mountain Range and Planet
range: planet
domain: mountain range
type: ObjectProperty

has Fish
comment: Relation between Mountain Range and Fish
domain: mountain range
range: fish
comment: Relazione tra Mountain Range e Fish @it
type: ObjectProperty

criminal
type: Class
label: criminel @fr

amphibian
label: amphibien @fr
type: Class

has Beverage
type: ObjectProperty
domain: mountain range
comment: Relazione tra Mountain Range e Beverage @it
comment: Relation between Mountain Range and Beverage
range: beverage

has Historic Place
comment: Relation between Mountain Range and Historic Place
comment: Relazione tra Mountain Range e Historic Place @it
range: historic place
type: ObjectProperty
domain: mountain range

flowering plant
type: Class
label: angiospermes @fr

has Race
comment: Relation between Mountain Range and Race
type: ObjectProperty
comment: Relazione tra Mountain Range e Race @it
domain: mountain range
range: race

senator
type: Class
label: sénateur @fr

has Judge
range: judge
comment: Relazione tra Mountain Range e Judge @it
comment: Relation between Mountain Range and Judge
domain: mountain range
type: ObjectProperty

saint
type: Class

has Arachnid
range: arachnid
domain: mountain range
type: ObjectProperty
comment: Relazione tra Mountain Range e Arachnid @it
comment: Relation between Mountain Range and Arachnid

valley
type: Class
label: vallée @fr

has Bridge
comment: Relazione tra Mountain Range e Bridge @it
domain: mountain range
comment: Relation between Mountain Range and Bridge
range: bridge
type: ObjectProperty

newspaper
label: journal @fr
type: Class

has Island
related match: highestLocation
related match: region
comment: Relazione tra Mountain Range e Island @it
comment: Relation between Mountain Range and Island
type: ObjectProperty
domain: mountain range
range: island

ginkgo
type: Class

book
label: książka @pl
label: llibre @ca
label: βιβλίο @el
label: livre @fr
type: Class

judge
label: juge @fr
type: Class

has Space Mission
comment: Relazione tra Mountain Range e Space Mission @it
type: ObjectProperty
comment: Relation between Mountain Range and Space Mission
domain: mountain range
range: space mission

has Language
range: language
comment: Relation between Mountain Range and Language
type: ObjectProperty
comment: Relazione tra Mountain Range e Language @it
domain: mountain range

has Comics Character
range: comics character
type: ObjectProperty
domain: mountain range
comment: Relazione tra Mountain Range e Comics Character @it
comment: Relation between Mountain Range and Comics Character

World Heritage Site
type: Class
label: site du patrimoine mondial @fr

shopping mall
label: centre commercial @fr
type: Class

has Military Unit
comment: Relation between Mountain Range and Military Unit
comment: Relazione tra Mountain Range e Military Unit @it
range: military unit
type: ObjectProperty
domain: mountain range

language
label: langage @fr
type: Class

has Scientist
domain: mountain range
type: ObjectProperty
range: scientist
comment: Relation between Mountain Range and Scientist
comment: Relazione tra Mountain Range e Scientist @it

ski area
type: Class
label: domaine skiable @fr

space station
type: Class
label: station spatiale @fr

has Amphibian
type: ObjectProperty
range: amphibian
domain: mountain range
comment: Relazione tra Mountain Range e Amphibian @it
comment: Relation between Mountain Range and Amphibian

non-profit organisation
label: organisation à but non lucratif @fr
type: Class

has Video Game
domain: mountain range
type: ObjectProperty
comment: Relation between Mountain Range and Video Game
range: video game
comment: Relazione tra Mountain Range e Video Game @it

has American Football Player
domain: mountain range
comment: Relation between Mountain Range and American Football Player
comment: Relazione tra Mountain Range e American Football Player @it
type: ObjectProperty
range: american football player

has Conifer
comment: Relazione tra Mountain Range e Conifer @it
type: ObjectProperty
range: conifer
domain: mountain range
comment: Relation between Mountain Range and Conifer

has Sport
comment: Relazione tra Mountain Range e Sport @it
comment: Relation between Mountain Range and Sport
domain: mountain range
type: ObjectProperty
range: sport

mollusca
type: Class
label: mollusque @fr

arachnid
type: Class
label: arachnides @fr

has Fern
comment: Relation between Mountain Range and Fern
type: ObjectProperty
domain: mountain range
comment: Relazione tra Mountain Range e Fern @it
range: fern

wine region
label: région viticole @fr
type: Class

governor
type: Class
label: gouverneur @fr

drug
type: Class
label: médicament @fr

Axiom
matching quantification: 1
annotated target: region
annotated source: has Island

has Crustacean
comment: Relation between Mountain Range and Crustacean
comment: Relazione tra Mountain Range e Crustacean @it
range: crustacean
domain: mountain range
type: ObjectProperty

has Prime Minister
comment: Relation between Mountain Range and Prime Minister
type: ObjectProperty
domain: mountain range
range: prime minister
comment: Relazione tra Mountain Range e Prime Minister @it

has Award
comment: Relazione tra Mountain Range e Award @it
domain: mountain range
range: award
comment: Relation between Mountain Range and Award
type: ObjectProperty

has Anatomical Structure
range: anatomical structure
comment: Relazione tra Mountain Range e Anatomical Structure @it
type: ObjectProperty
comment: Relation between Mountain Range and Anatomical Structure
domain: mountain range

school
label: école @fr
type: Class

has Space Station
domain: mountain range
range: space station
type: ObjectProperty
comment: Relazione tra Mountain Range e Space Station @it
comment: Relation between Mountain Range and Space Station

ship
type: Class
label: navire @fr

museum
label: musée @fr
type: Class

fish
label: poisson @fr
type: Class

video game
type: Class
label: jeux vidéo @fr

has Non- Profit Organisation
type: ObjectProperty
comment: Relazione tra Mountain Range e Non- Profit Organisation @it
comment: Relation between Mountain Range and Non- Profit Organisation
range: non-profit organisation
domain: mountain range

canal
type: Class

military person
type: Class
label: militaire @fr

has Village
type: ObjectProperty
comment: Relation between Mountain Range and Village
range: village
comment: Relazione tra Mountain Range e Village @it
domain: mountain range

has Broadcast
domain: mountain range
type: ObjectProperty
comment: Relation between Mountain Range and Broadcast
range: broadcast
comment: Relazione tra Mountain Range e Broadcast @it

philosopher
type: Class
label: philosophe @fr

has Flowering Plant
domain: mountain range
type: ObjectProperty
range: flowering plant
comment: Relazione tra Mountain Range e Flowering Plant @it
comment: Relation between Mountain Range and Flowering Plant

currency
label: devise @fr
type: Class

Axiom
annotated target: etymology
annotated source: has Continent
matching quantification: 1

award
type: Class
label: récompense @fr

has Airport
comment: Relazione tra Mountain Range e Airport @it
type: ObjectProperty
range: airport
comment: Relation between Mountain Range and Airport
domain: mountain range

prime minister
label: premier ministre @fr
type: Class

British royalty
type: Class
label: royauté Britannique @fr

race
label: course @fr
type: Class

historic place
label: site historique @fr
type: Class

anatomical structure
type: Class
label: structure anatomique @fr

sport
type: Class

has Music Festival
type: ObjectProperty
comment: Relation between Mountain Range and Music Festival
comment: Relazione tra Mountain Range e Music Festival @it
domain: mountain range
range: music festival

has Moss
type: ObjectProperty
comment: Relation between Mountain Range and Moss
range: moss
domain: mountain range
comment: Relazione tra Mountain Range e Moss @it

has Film
range: film
comment: Relation between Mountain Range and Film
comment: Relazione tra Mountain Range e Film @it
domain: mountain range
type: ObjectProperty

single
type: Class

has Newspaper
range: newspaper
domain: mountain range
type: ObjectProperty
comment: Relazione tra Mountain Range e Newspaper @it
comment: Relation between Mountain Range and Newspaper

Band
label: groupe de musique @fr
type: Class
label: Musikgruppe @de
label: banda @pt

Axiom
annotated target: highestLocation
matching quantification: 1
annotated source: has Island

has Music Genre
type: ObjectProperty
comment: Relation between Mountain Range and Music Genre
comment: Relazione tra Mountain Range e Music Genre @it
range: music genre
domain: mountain range

university
type: Class
label: université @fr
label: πανεπιστήμιο @el

continent
type: Class
label: ήπειρος @el

has Musical
type: ObjectProperty
domain: mountain range
comment: Relazione tra Mountain Range e Musical @it
comment: Relation between Mountain Range and Musical
range: musical

ethnic group
label: groupe ethnique @fr
type: Class

has Office Holder
comment: Relation between Mountain Range and Office Holder
domain: mountain range
type: ObjectProperty
comment: Relazione tra Mountain Range e Office Holder @it
range: office holder

president
type: Class
label: président @fr

album
label: Album @de
type: Class

has Military Conflict
type: ObjectProperty
comment: Relazione tra Mountain Range e Military Conflict @it
domain: mountain range
comment: Relation between Mountain Range and Military Conflict
range: military conflict

moss
type: Class
label: mousses @fr

music festival
label: festival de musique @fr
type: Class

has Olympics
comment: Relazione tra Mountain Range e Olympics @it
type: ObjectProperty
domain: mountain range
comment: Relation between Mountain Range and Olympics
range: olympics

has Insect
domain: mountain range
type: ObjectProperty
comment: Relation between Mountain Range and Insect
comment: Relazione tra Mountain Range e Insect @it
range: insect

has Bird
comment: Relazione tra Mountain Range e Bird @it
comment: Relation between Mountain Range and Bird
type: ObjectProperty
domain: mountain range
range: bird

has Senator
domain: mountain range
range: senator
comment: Relation between Mountain Range and Senator
comment: Relazione tra Mountain Range e Senator @it
type: ObjectProperty

military unit
label: unité militaire @fr
type: Class

has Book
comment: Relazione tra Mountain Range e Book @it
comment: Relation between Mountain Range and Book
domain: mountain range
type: ObjectProperty
range: book

has Congressman
comment: Relazione tra Mountain Range e Congressman @it
domain: mountain range
comment: Relation between Mountain Range and Congressman
range: congressman
type: ObjectProperty

village
label: χωριό @el
type: Class

has Gnetophytes
range: Gnetophytes
comment: Relazione tra Mountain Range e Gnetophytes @it
domain: mountain range
type: ObjectProperty
comment: Relation between Mountain Range and Gnetophytes

soccer club
type: Class
label: club de football @fr

music genre
label: genre musical @fr
label: género musical @pt
type: Class

has Fungus
type: ObjectProperty
range: fungus
comment: Relazione tra Mountain Range e Fungus @it
domain: mountain range
comment: Relation between Mountain Range and Fungus

cycad
label: cycadophytes @fr
type: Class

has Musical Artist
domain: mountain range
comment: Relazione tra Mountain Range e Musical Artist @it
type: ObjectProperty
range: musical artist
comment: Relation between Mountain Range and Musical Artist

writer
type: Class
label: écrivain @fr

has Cycad
comment: Relation between Mountain Range and Cycad
type: ObjectProperty
domain: mountain range
range: cycad
comment: Relazione tra Mountain Range e Cycad @it

office holder
label: titulaire @fr
label: Amtsinhaber @de
type: Class

has Ethnic Group
range: ethnic group
type: ObjectProperty
domain: mountain range
comment: Relation between Mountain Range and Ethnic Group
comment: Relazione tra Mountain Range e Ethnic Group @it

military conflict
label: conflit militaire @fr
type: Class

website
label: Ιστότοπος @el
label: site web @fr
type: Class

has Canal
domain: mountain range
type: ObjectProperty
comment: Relazione tra Mountain Range e Canal @it
range: canal
comment: Relation between Mountain Range and Canal

crustacean
type: Class
label: crustacés @fr

has Valley
type: ObjectProperty
comment: Relazione tra Mountain Range e Valley @it
comment: Relation between Mountain Range and Valley
range: valley
domain: mountain range

has Cave
domain: mountain range
type: ObjectProperty
range: cave
comment: Relazione tra Mountain Range e Cave @it
comment: Relation between Mountain Range and Cave

has Military Person
comment: Relation between Mountain Range and Military Person
domain: mountain range
comment: Relazione tra Mountain Range e Military Person @it
type: ObjectProperty
range: military person

has Colour
comment: Relation between Mountain Range and Colour
domain: mountain range
range: colour
type: ObjectProperty
comment: Relazione tra Mountain Range e Colour @it

has Baseball League
comment: Relation between Mountain Range and Baseball League
comment: Relazione tra Mountain Range e Baseball League @it
domain: mountain range
range: baseball league
type: ObjectProperty

mountain range
type: Class
label: chaîne de montagne @fr

has Monarch
type: ObjectProperty
range: monarch
comment: Relazione tra Mountain Range e Monarch @it
domain: mountain range
comment: Relation between Mountain Range and Monarch

beverage
label: boisson @fr
type: Class

lighthouse
type: Class
label: phare @fr

comics creator
label: créateur de bandes dessinées @fr
type: Class

has Television Show
domain: mountain range
comment: Relation between Mountain Range and Television Show
comment: Relazione tra Mountain Range e Television Show @it
type: ObjectProperty
range: television show

planet
label: planète @fr
type: Class

has Ship
comment: Relazione tra Mountain Range e Ship @it
comment: Relation between Mountain Range and Ship
type: ObjectProperty
domain: mountain range
range: ship

scientist
label: scientifique @fr
type: Class
label: Wissenschaftler @de

has President
comment: Relazione tra Mountain Range e President @it
domain: mountain range
comment: Relation between Mountain Range and President
type: ObjectProperty
range: president

reptile
type: Class

legislature
label: pouvoir législatif @fr
type: Class

cave
label: grotte @fr
type: Class

has Museum
range: museum
comment: Relation between Mountain Range and Museum
comment: Relazione tra Mountain Range e Museum @it
domain: mountain range
type: ObjectProperty

has University
range: university
domain: mountain range
comment: Relation between Mountain Range and University
type: ObjectProperty
comment: Relazione tra Mountain Range e University @it

has Shopping Mall
comment: Relation between Mountain Range and Shopping Mall
type: ObjectProperty
comment: Relazione tra Mountain Range e Shopping Mall @it
domain: mountain range
range: shopping mall

airline
type: Class
label: compagnie aérienne @fr

olympics
label: Jeux Olympiques @fr
type: Class

has Soccer Club
range: soccer club
domain: mountain range
type: ObjectProperty
comment: Relazione tra Mountain Range e Soccer Club @it
comment: Relation between Mountain Range and Soccer Club

monarch
label: monarque @fr
type: Class

baseball league
type: Class
label: ligue de baseball @fr

congressman
label: membre du Congrès @fr
type: Class

bridge
label: pont @fr
type: Class

Gnetophytes
type: Class
label: gnétophytes @fr

has Governor
comment: Relazione tra Mountain Range e Governor @it
domain: mountain range
type: ObjectProperty
comment: Relation between Mountain Range and Governor
range: governor

space mission
label: mission spatiale @fr
label: διαστημική αποστολή @el
type: Class

has School
comment: Relation between Mountain Range and School
type: ObjectProperty
comment: Relazione tra Mountain Range e School @it
range: school
domain: mountain range

has Chemical Compound
domain: mountain range
comment: Relation between Mountain Range and Chemical Compound
type: ObjectProperty
range: chemical compound
comment: Relazione tra Mountain Range e Chemical Compound @it

broadcast
label: Émission de télévision @fr
type: Class

insect
type: Class
label: insecte @fr

has Single
comment: Relazione tra Mountain Range e Single @it
type: ObjectProperty
domain: mountain range
range: single
comment: Relation between Mountain Range and Single

film
type: Class
label: ταινία @el

mammal
label: mammifère @fr
type: Class

has Website
domain: mountain range
comment: Relazione tra Mountain Range e Website @it
comment: Relation between Mountain Range and Website
type: ObjectProperty
range: website

island
label: île @fr
label: νησί @el
type: Class

has British Royalty
comment: Relation between Mountain Range and British Royalty
domain: mountain range
comment: Relazione tra Mountain Range e British Royalty @it
range: British royalty
type: ObjectProperty

has Continent
related match: etymology
comment: Relation between Mountain Range and Continent
type: ObjectProperty
range: continent
comment: Relazione tra Mountain Range e Continent @it
domain: mountain range

has Actor
comment: Relation between Mountain Range and Actor
comment: Relazione tra Mountain Range e Actor @it
range: actor
type: ObjectProperty
domain: mountain range

comics character
type: Class
label: personnage de bandes dessinées @fr

bird
type: Class
label: oiseau @fr

chemical compound
type: Class
label: produit chimique @fr

has Ski Area
range: ski area
comment: Relazione tra Mountain Range e Ski Area @it
domain: mountain range
comment: Relation between Mountain Range and Ski Area
type: ObjectProperty

has Album
range: album
type: ObjectProperty
comment: Relazione tra Mountain Range e Album @it
domain: mountain range
comment: Relation between Mountain Range and Album

has Philosopher
comment: Relation between Mountain Range and Philosopher
comment: Relazione tra Mountain Range e Philosopher @it
domain: mountain range
type: ObjectProperty
range: philosopher

has Band
domain: mountain range
type: ObjectProperty
comment: Relazione tra Mountain Range e Band @it
range: Band
comment: Relation between Mountain Range and Band

fern
label: fougères @fr
type: Class

fungus
type: Class
label: fungi @fr

musical artist
label: musicien @fr
type: Class
label: artista musical @pt

has Saint
comment: Relazione tra Mountain Range e Saint @it
comment: Relation between Mountain Range and Saint
range: saint
domain: mountain range
type: ObjectProperty

has Currency
comment: Relazione tra Mountain Range e Currency @it
range: currency
comment: Relation between Mountain Range and Currency
type: ObjectProperty
domain: mountain range

has Drug
comment: Relation between Mountain Range and Drug
comment: Relazione tra Mountain Range e Drug @it
range: drug
type: ObjectProperty
domain: mountain range

has Wine Region
comment: Relation between Mountain Range and Wine Region
comment: Relazione tra Mountain Range e Wine Region @it
range: wine region
type: ObjectProperty
domain: mountain range

airport
type: Class
label: Flughafen @de
label: aéroport @fr

conifer
label: conifères @fr
type: Class