Ontology
extracted from: en.wikipedia.org
extracted from: dbpedia.org
has author: Valentina Presutti
has author: Andrea Giovanni Nuzzolese
has intent: To represent the encyclopedic knowledge expressed by an object typed as MusicFestival
comment: MusicFestival Encyclopedic Knowledge Pattern
has author: Aldo Gangemi
imports: cpannotationschema.owl

television show
type: Class
label: émission de télévision @fr

disease
label: maladie @fr
type: Class

has Video Game
type: ObjectProperty
comment: Relazione tra Music Festival e Video Game @it
comment: Relation between Music Festival and Video Game
domain: music festival
range: video game

has Stadium
related match: location
type: ObjectProperty
comment: Relazione tra Music Festival e Stadium @it
range: stadium
domain: music festival
comment: Relation between Music Festival and Stadium

has Military Unit
domain: music festival
type: ObjectProperty
comment: Relation between Music Festival and Military Unit
range: military unit
comment: Relazione tra Music Festival e Military Unit @it

colour
label: χρώμα @el
label: couleur @fr
type: Class

automobile
type: Class

has Senator
type: ObjectProperty
range: senator
domain: music festival
comment: Relazione tra Music Festival e Senator @it
comment: Relation between Music Festival and Senator

Election
type: Class
label: élection @fr

has Award
domain: music festival
range: award
comment: Relazione tra Music Festival e Award @it
type: ObjectProperty
comment: Relation between Music Festival and Award

american football player
type: Class
label: joueur de football américain @fr

has Automobile
range: automobile
comment: Relazione tra Music Festival e Automobile @it
type: ObjectProperty
comment: Relation between Music Festival and Automobile
domain: music festival

has Book
comment: Relazione tra Music Festival e Book @it
range: book
comment: Relation between Music Festival and Book
domain: music festival
type: ObjectProperty

has Comics Character
type: ObjectProperty
range: comics character
comment: Relation between Music Festival and Comics Character
domain: music festival
comment: Relazione tra Music Festival e Comics Character @it

stadium
type: Class
label: stade @fr

has American Football Player
range: american football player
comment: Relazione tra Music Festival e American Football Player @it
domain: music festival
type: ObjectProperty
comment: Relation between Music Festival and American Football Player

has Film Festival
comment: Relation between Music Festival and Film Festival
domain: music festival
range: film festival
type: ObjectProperty
comment: Relazione tra Music Festival e Film Festival @it

has Protected Area
type: ObjectProperty
comment: Relation between Music Festival and Protected Area
range: protected area
comment: Relazione tra Music Festival e Protected Area @it
domain: music festival

has University
comment: Relation between Music Festival and University
comment: Relazione tra Music Festival e University @it
domain: music festival
range: university
type: ObjectProperty

has Ship
comment: Relazione tra Music Festival e Ship @it
domain: music festival
range: ship
comment: Relation between Music Festival and Ship
type: ObjectProperty

has Broadcast
comment: Relation between Music Festival and Broadcast
domain: music festival
range: broadcast
comment: Relazione tra Music Festival e Broadcast @it
type: ObjectProperty

wrestler
label: lutteur @fr
type: Class

mayor
type: Class
label: maire @fr

has Fish
type: ObjectProperty
domain: music festival
comment: Relazione tra Music Festival e Fish @it
comment: Relation between Music Festival and Fish
range: fish

has Eurovision Song Contest Entry
comment: Relazione tra Music Festival e Eurovision Song Contest Entry @it
range: Eurovision song contest entry
comment: Relation between Music Festival and Eurovision Song Contest Entry
domain: music festival
type: ObjectProperty

has Sport
domain: music festival
range: sport
comment: Relazione tra Music Festival e Sport @it
type: ObjectProperty
comment: Relation between Music Festival and Sport

has Member Of Parliament
type: ObjectProperty
range: member of parliament
comment: Relazione tra Music Festival e Member Of Parliament @it
comment: Relation between Music Festival and Member Of Parliament
domain: music festival

newspaper
type: Class
label: journal @fr

has Planet
domain: music festival
type: ObjectProperty
comment: Relation between Music Festival and Planet
comment: Relazione tra Music Festival e Planet @it
range: planet

protected area
type: Class
label: προστατευμένη περιοχή @el
label: aire protégée @fr

game
type: Class
label: jeu @fr

road
type: Class
label: route @fr

boxer
label: boxeur @fr
type: Class

World Heritage Site
label: site du patrimoine mondial @fr
type: Class

has College Coach
comment: Relazione tra Music Festival e College Coach @it
range: college coach
type: ObjectProperty
comment: Relation between Music Festival and College Coach
domain: music festival

language
type: Class
label: langage @fr

has Road
range: road
type: ObjectProperty
comment: Relazione tra Music Festival e Road @it
comment: Relation between Music Festival and Road
domain: music festival

has Continent
comment: Relazione tra Music Festival e Continent @it
comment: Relation between Music Festival and Continent
range: continent
domain: music festival
type: ObjectProperty

lake
type: Class
label: lac @fr

has Mountain
comment: Relazione tra Music Festival e Mountain @it
type: ObjectProperty
domain: music festival
comment: Relation between Music Festival and Mountain
range: mountain

governor
type: Class
label: gouverneur @fr

has Artery
comment: Relation between Music Festival and Artery
type: ObjectProperty
comment: Relazione tra Music Festival e Artery @it
range: artery
domain: music festival

river
label: rivière @fr
type: Class

school
type: Class
label: école @fr

fish
type: Class
label: poisson @fr

museum
label: musée @fr
type: Class

ship
label: navire @fr
type: Class

tennis player
label: joueur de tennis @fr
type: Class

video game
type: Class
label: jeux vidéo @fr

trade union
label: syndicat professionnel @fr
type: Class

has Formula One Racer
comment: Relazione tra Music Festival e Formula One Racer @it
comment: Relation between Music Festival and Formula One Racer
domain: music festival
type: ObjectProperty
range: Formula One racer

currency
type: Class
label: devise @fr

British royalty
label: royauté Britannique @fr
type: Class

prime minister
label: premier ministre @fr
type: Class

has Saint
type: ObjectProperty
comment: Relazione tra Music Festival e Saint @it
range: saint
domain: music festival
comment: Relation between Music Festival and Saint

has Mayor
comment: Relation between Music Festival and Mayor
type: ObjectProperty
domain: music festival
range: mayor
comment: Relazione tra Music Festival e Mayor @it

has Website
range: website
type: ObjectProperty
comment: Relazione tra Music Festival e Website @it
domain: music festival
comment: Relation between Music Festival and Website

historic place
type: Class
label: site historique @fr

has Disease
comment: Relazione tra Music Festival e Disease @it
comment: Relation between Music Festival and Disease
domain: music festival
range: disease
type: ObjectProperty

hospital
type: Class
label: hôpital @fr

has Lake
comment: Relation between Music Festival and Lake
comment: Relazione tra Music Festival e Lake @it
type: ObjectProperty
domain: music festival
range: lake

has Flowering Plant
domain: music festival
type: ObjectProperty
comment: Relazione tra Music Festival e Flowering Plant @it
comment: Relation between Music Festival and Flowering Plant
range: flowering plant

has Christian Bishop
comment: Relation between Music Festival and Christian Bishop
comment: Relazione tra Music Festival e Christian Bishop @it
type: ObjectProperty
range: Christian Bishop
domain: music festival

has President
related match: founders
comment: Relation between Music Festival and President
range: president
domain: music festival
type: ObjectProperty
comment: Relazione tra Music Festival e President @it

continent
label: ήπειρος @el
type: Class

president
type: Class
label: président @fr

figure skater
type: Class
label: patineur artistique @fr

has Election
domain: music festival
range: Election
comment: Relazione tra Music Festival e Election @it
comment: Relation between Music Festival and Election
type: ObjectProperty

has Soccer Player
type: ObjectProperty
domain: music festival
comment: Relation between Music Festival and Soccer Player
range: soccer player
comment: Relazione tra Music Festival e Soccer Player @it

has Basketball Player
domain: music festival
comment: Relation between Music Festival and Basketball Player
comment: Relazione tra Music Festival e Basketball Player @it
range: basketball player
type: ObjectProperty

has Colour
comment: Relation between Music Festival and Colour
comment: Relazione tra Music Festival e Colour @it
range: colour
domain: music festival
type: ObjectProperty

military unit
label: unité militaire @fr
type: Class

soccer manager
type: Class
label: entraîneur de football @fr

has Park
comment: Relation between Music Festival and Park
range: park
domain: music festival
comment: Relazione tra Music Festival e Park @it
type: ObjectProperty

has Newspaper
type: ObjectProperty
domain: music festival
comment: Relazione tra Music Festival e Newspaper @it
range: newspaper
comment: Relation between Music Festival and Newspaper

writer
type: Class
label: écrivain @fr

record label
label: label discographique @fr
type: Class

architect
label: architecte @fr
type: Class

model
label: mannequin @fr
type: Class

has Town
domain: music festival
type: ObjectProperty
comment: Relation between Music Festival and Town
range: town
comment: Relazione tra Music Festival e Town @it
related match: location

has Non- Profit Organisation
domain: music festival
range: non-profit organisation
comment: Relazione tra Music Festival e Non- Profit Organisation @it
type: ObjectProperty
comment: Relation between Music Festival and Non- Profit Organisation

film festival
type: Class
label: festival du film @fr

has Shopping Mall
comment: Relazione tra Music Festival e Shopping Mall @it
range: shopping mall
type: ObjectProperty
domain: music festival
comment: Relation between Music Festival and Shopping Mall

Axiom
matching quantification: 1
annotated target: founders
annotated source: has President

has Radio Station
domain: music festival
range: radio station
comment: Relation between Music Festival and Radio Station
type: ObjectProperty
comment: Relazione tra Music Festival e Radio Station @it

comics creator
type: Class
label: créateur de bandes dessinées @fr

aircraft
label: αεροσκάφος @el
type: Class
label: avion @fr

has Reptile
type: ObjectProperty
comment: Relazione tra Music Festival e Reptile @it
range: reptile
domain: music festival
comment: Relation between Music Festival and Reptile

has Adult Actor
range: adult actor
domain: music festival
comment: Relazione tra Music Festival e Adult Actor @it
comment: Relation between Music Festival and Adult Actor
type: ObjectProperty

has Historic Place
comment: Relation between Music Festival and Historic Place
comment: Relazione tra Music Festival e Historic Place @it
domain: music festival
range: historic place
type: ObjectProperty

soccer player
label: joueur de football @fr
type: Class

has Language
type: ObjectProperty
comment: Relation between Music Festival and Language
comment: Relazione tra Music Festival e Language @it
domain: music festival
range: language

reptile
type: Class

legislature
label: pouvoir législatif @fr
type: Class

airline
label: compagnie aérienne @fr
type: Class

has Restaurant
range: restaurant
domain: music festival
comment: Relazione tra Music Festival e Restaurant @it
comment: Relation between Music Festival and Restaurant
type: ObjectProperty

monarch
type: Class
label: monarque @fr

has Bridge
domain: music festival
type: ObjectProperty
comment: Relation between Music Festival and Bridge
comment: Relazione tra Music Festival e Bridge @it
range: bridge

congressman
label: membre du Congrès @fr
type: Class

golf player
label: golfeur @fr
type: Class

has Scientist
range: scientist
comment: Relazione tra Music Festival e Scientist @it
comment: Relation between Music Festival and Scientist
type: ObjectProperty
domain: music festival

journalist
label: journaliste @fr
type: Class

insect
type: Class
label: insecte @fr

american football team
label: équipe américaine de football américain @fr
type: Class

bird
label: oiseau @fr
type: Class

chemical compound
label: produit chimique @fr
type: Class

Gaelic games player
type: Class
label: joueur de sports gaéliques @fr

has World Heritage Site
comment: Relazione tra Music Festival e World Heritage Site @it
comment: Relation between Music Festival and World Heritage Site
type: ObjectProperty
domain: music festival
range: World Heritage Site

has Wrestling Event
type: ObjectProperty
domain: music festival
comment: Relation between Music Festival and Wrestling Event
comment: Relazione tra Music Festival e Wrestling Event @it
range: wrestling event

has Ethnic Group
type: ObjectProperty
comment: Relazione tra Music Festival e Ethnic Group @it
comment: Relation between Music Festival and Ethnic Group
domain: music festival
range: ethnic group

has Journalist
domain: music festival
range: journalist
comment: Relazione tra Music Festival e Journalist @it
comment: Relation between Music Festival and Journalist
type: ObjectProperty

has Criminal
comment: Relazione tra Music Festival e Criminal @it
comment: Relation between Music Festival and Criminal
range: criminal
domain: music festival
type: ObjectProperty

has Hospital
range: hospital
comment: Relazione tra Music Festival e Hospital @it
comment: Relation between Music Festival and Hospital
domain: music festival
type: ObjectProperty

park
label: parc @fr
type: Class

has Legislature
comment: Relation between Music Festival and Legislature
comment: Relazione tra Music Festival e Legislature @it
range: legislature
domain: music festival
type: ObjectProperty

has Rugby Player
range: rugby player
comment: Relation between Music Festival and Rugby Player
domain: music festival
comment: Relazione tra Music Festival e Rugby Player @it
type: ObjectProperty

rugby player
type: Class
label: joueur de rugby @fr

has Golf Player
comment: Relation between Music Festival and Golf Player
comment: Relazione tra Music Festival e Golf Player @it
range: golf player
type: ObjectProperty
domain: music festival

musical
type: Class
label: musique @fr

has Television Episode
range: television episode
type: ObjectProperty
domain: music festival
comment: Relation between Music Festival and Television Episode
comment: Relazione tra Music Festival e Television Episode @it

has American Football Team
type: ObjectProperty
domain: music festival
comment: Relazione tra Music Festival e American Football Team @it
comment: Relation between Music Festival and American Football Team
range: american football team

wrestling event
type: Class
label: match de catch @fr

has Soccer Manager
comment: Relation between Music Festival and Soccer Manager
domain: music festival
range: soccer manager
comment: Relazione tra Music Festival e Soccer Manager @it
type: ObjectProperty

has Comics Creator
comment: Relazione tra Music Festival e Comics Creator @it
comment: Relation between Music Festival and Comics Creator
domain: music festival
type: ObjectProperty
range: comics creator

mountain
type: Class
label: montagne @fr
label: Βουνό @el

has Writer
type: ObjectProperty
domain: music festival
comment: Relation between Music Festival and Writer
range: writer
comment: Relazione tra Music Festival e Writer @it

criminal
type: Class
label: criminel @fr

has Museum
comment: Relazione tra Music Festival e Museum @it
type: ObjectProperty
range: museum
comment: Relation between Music Festival and Museum
domain: music festival

flowering plant
type: Class
label: angiospermes @fr

has Currency
range: currency
comment: Relation between Music Festival and Currency
type: ObjectProperty
comment: Relazione tra Music Festival e Currency @it
domain: music festival

saint
type: Class

senator
label: sénateur @fr
type: Class

comedian
label: comédien @fr
type: Class

convention
type: Class
label: congrès @fr

book
label: llibre @ca
label: książka @pl
label: βιβλίο @el
label: livre @fr
type: Class

has Single
comment: Relation between Music Festival and Single
comment: Relazione tra Music Festival e Single @it
type: ObjectProperty
range: single
domain: music festival

has Congressman
range: congressman
type: ObjectProperty
domain: music festival
comment: Relation between Music Festival and Congressman
comment: Relazione tra Music Festival e Congressman @it

shopping mall
label: centre commercial @fr
type: Class

Axiom
annotated target: location
matching quantification: 1
annotated source: has Stadium

has British Royalty
range: British royalty
type: ObjectProperty
comment: Relazione tra Music Festival e British Royalty @it
comment: Relation between Music Festival and British Royalty
domain: music festival
related match: founders

Axiom
annotated target: location
matching quantification: 1
annotated source: has Island

ski area
type: Class
label: domaine skiable @fr

non-profit organisation
label: organisation à but non lucratif @fr
type: Class

has Soccer Club
type: ObjectProperty
domain: music festival
comment: Relazione tra Music Festival e Soccer Club @it
range: soccer club
comment: Relation between Music Festival and Soccer Club

has Military Conflict
comment: Relation between Music Festival and Military Conflict
range: military conflict
domain: music festival
type: ObjectProperty
comment: Relazione tra Music Festival e Military Conflict @it

has Baseball Player
domain: music festival
range: baseball player
comment: Relation between Music Festival and Baseball Player
type: ObjectProperty
comment: Relazione tra Music Festival e Baseball Player @it

drug
type: Class
label: médicament @fr

magazine
type: Class
label: περιοδικό @el

has Village
comment: Relation between Music Festival and Village
domain: music festival
type: ObjectProperty
comment: Relazione tra Music Festival e Village @it
range: village

has Aircraft
domain: music festival
comment: Relazione tra Music Festival e Aircraft @it
type: ObjectProperty
comment: Relation between Music Festival and Aircraft
range: aircraft

Axiom
annotated target: location
matching quantification: 1
annotated source: has Town

Axiom
annotated target: founders
annotated source: has British Royalty
matching quantification: 1

award
type: Class
label: récompense @fr

sport
type: Class

has School
range: school
comment: Relation between Music Festival and School
domain: music festival
comment: Relazione tra Music Festival e School @it
type: ObjectProperty

restaurant
type: Class

cricketer
type: Class
label: joueur de cricket @fr

single
type: Class

town
label: ville @fr
type: Class

has Mountain Range
type: ObjectProperty
domain: music festival
comment: Relazione tra Music Festival e Mountain Range @it
comment: Relation between Music Festival and Mountain Range
range: mountain range

university
label: πανεπιστήμιο @el
label: université @fr
type: Class

has Office Holder
comment: Relazione tra Music Festival e Office Holder @it
range: office holder
type: ObjectProperty
domain: music festival
comment: Relation between Music Festival and Office Holder

has Insect
comment: Relazione tra Music Festival e Insect @it
type: ObjectProperty
domain: music festival
comment: Relation between Music Festival and Insect
range: insect

ethnic group
label: groupe ethnique @fr
type: Class

has Hotel
comment: Relation between Music Festival and Hotel
type: ObjectProperty
domain: music festival
comment: Relazione tra Music Festival e Hotel @it
range: hotel

artery
label: Arterie @de
type: Class
label: artère @fr

hotel
type: Class
label: hôtel @fr

music festival
type: Class
label: festival de musique @fr

college coach
label: entraîneur universitaire @fr
type: Class

television episode
type: Class
label: épisode télévisé @fr

village
label: χωριό @el
type: Class

has Airline
comment: Relazione tra Music Festival e Airline @it
comment: Relation between Music Festival and Airline
type: ObjectProperty
range: airline
domain: music festival

has Airport
comment: Relazione tra Music Festival e Airport @it
domain: music festival
comment: Relation between Music Festival and Airport
range: airport
type: ObjectProperty

soccer club
type: Class
label: club de football @fr

has Island
range: island
domain: music festival
comment: Relation between Music Festival and Island
comment: Relazione tra Music Festival e Island @it
type: ObjectProperty
related match: location

has Drug
domain: music festival
type: ObjectProperty
comment: Relazione tra Music Festival e Drug @it
comment: Relation between Music Festival and Drug
range: drug

office holder
type: Class
label: Amtsinhaber @de
label: titulaire @fr

baseball player
label: joueur de baseball @fr
type: Class

military conflict
label: conflit militaire @fr
type: Class

website
type: Class
label: site web @fr
label: Ιστότοπος @el

has Monarch
domain: music festival
comment: Relazione tra Music Festival e Monarch @it
comment: Relation between Music Festival and Monarch
type: ObjectProperty
range: monarch

has Convention
domain: music festival
comment: Relazione tra Music Festival e Convention @it
comment: Relation between Music Festival and Convention
range: convention
type: ObjectProperty

has Beverage
comment: Relation between Music Festival and Beverage
type: ObjectProperty
domain: music festival
range: beverage
comment: Relazione tra Music Festival e Beverage @it

has Architect
type: ObjectProperty
comment: Relazione tra Music Festival e Architect @it
comment: Relation between Music Festival and Architect
range: architect
domain: music festival

has Chemical Compound
range: chemical compound
comment: Relation between Music Festival and Chemical Compound
comment: Relazione tra Music Festival e Chemical Compound @it
domain: music festival
type: ObjectProperty

has Ski Area
type: ObjectProperty
range: ski area
comment: Relazione tra Music Festival e Ski Area @it
domain: music festival
comment: Relation between Music Festival and Ski Area

basketball player
label: joueur de basketball @fr
type: Class

adult actor
label: acteur adulte @fr
type: Class
label: erwachsener Schauspieler @de

has Cricketer
domain: music festival
comment: Relation between Music Festival and Cricketer
comment: Relazione tra Music Festival e Cricketer @it
type: ObjectProperty
range: cricketer

mountain range
type: Class
label: chaîne de montagne @fr

Christian Bishop
type: Class
label: évêque chrétien @fr

beverage
type: Class
label: boisson @fr

sports league
type: Class
label: ligue sportive @fr

has Trade Union
type: ObjectProperty
comment: Relazione tra Music Festival e Trade Union @it
comment: Relation between Music Festival and Trade Union
domain: music festival
range: trade union

has Boxer
domain: music festival
type: ObjectProperty
comment: Relazione tra Music Festival e Boxer @it
range: boxer
comment: Relation between Music Festival and Boxer

planet
type: Class
label: planète @fr

has Skyscraper
domain: music festival
type: ObjectProperty
range: skyscraper
comment: Relation between Music Festival and Skyscraper
comment: Relazione tra Music Festival e Skyscraper @it

has Prime Minister
range: prime minister
type: ObjectProperty
comment: Relazione tra Music Festival e Prime Minister @it
domain: music festival
comment: Relation between Music Festival and Prime Minister

has Wrestler
range: wrestler
domain: music festival
comment: Relation between Music Festival and Wrestler
comment: Relazione tra Music Festival e Wrestler @it
type: ObjectProperty

scientist
label: scientifique @fr
type: Class
label: Wissenschaftler @de

has Record Label
comment: Relazione tra Music Festival e Record Label @it
domain: music festival
range: record label
type: ObjectProperty
comment: Relation between Music Festival and Record Label

has Mammal
comment: Relazione tra Music Festival e Mammal @it
comment: Relation between Music Festival and Mammal
domain: music festival
range: mammal
type: ObjectProperty

has River
domain: music festival
comment: Relation between Music Festival and River
comment: Relazione tra Music Festival e River @it
range: river
type: ObjectProperty

has Sports League
domain: music festival
type: ObjectProperty
comment: Relazione tra Music Festival e Sports League @it
comment: Relation between Music Festival and Sports League
range: sports league

bridge
type: Class
label: pont @fr

has Gaelic Games Player
comment: Relazione tra Music Festival e Gaelic Games Player @it
comment: Relation between Music Festival and Gaelic Games Player
range: Gaelic games player
type: ObjectProperty
domain: music festival

has Figure Skater
comment: Relation between Music Festival and Figure Skater
comment: Relazione tra Music Festival e Figure Skater @it
type: ObjectProperty
domain: music festival
range: figure skater

has Model
type: ObjectProperty
comment: Relation between Music Festival and Model
range: model
domain: music festival
comment: Relazione tra Music Festival e Model @it

has Game
comment: Relation between Music Festival and Game
type: ObjectProperty
comment: Relazione tra Music Festival e Game @it
range: game
domain: music festival

broadcast
type: Class
label: Émission de télévision @fr

mammal
label: mammifère @fr
type: Class

Eurovision song contest entry
type: Class
label: concours Eurovision de la chanson @fr

island
type: Class
label: νησί @el
label: île @fr

has Magazine
comment: Relazione tra Music Festival e Magazine @it
comment: Relation between Music Festival and Magazine
domain: music festival
type: ObjectProperty
range: magazine

comics character
type: Class
label: personnage de bandes dessinées @fr

has Governor
domain: music festival
type: ObjectProperty
range: governor
comment: Relazione tra Music Festival e Governor @it
comment: Relation between Music Festival and Governor

Formula One racer
label: pilote de formule 1 @fr
type: Class

skyscraper
label: gratte-ciel @fr
type: Class

has Tennis Player
domain: music festival
comment: Relazione tra Music Festival e Tennis Player @it
type: ObjectProperty
range: tennis player
comment: Relation between Music Festival and Tennis Player

radio station
label: station de radio @fr
type: Class

has Musical
range: musical
domain: music festival
comment: Relazione tra Music Festival e Musical @it
comment: Relation between Music Festival and Musical
type: ObjectProperty

has Comedian
comment: Relation between Music Festival and Comedian
comment: Relazione tra Music Festival e Comedian @it
type: ObjectProperty
domain: music festival
range: comedian

member of parliament
type: Class
label: membre du Parlement @fr

has Television Show
range: television show
domain: music festival
comment: Relazione tra Music Festival e Television Show @it
type: ObjectProperty
comment: Relation between Music Festival and Television Show

airport
type: Class
label: Flughafen @de
label: aéroport @fr

has Bird
comment: Relation between Music Festival and Bird
comment: Relazione tra Music Festival e Bird @it
range: bird
domain: music festival
type: ObjectProperty