has Musical Artist
range: musical artist
type: ObjectProperty
comment: Relazione tra Nascar Driver e Musical Artist @it
comment: Relation between Nascar Driver and Musical Artist
domain: nascar driver

has Television Show
type: ObjectProperty
comment: Relazione tra Nascar Driver e Television Show @it
comment: Relation between Nascar Driver and Television Show
domain: nascar driver
range: television show

has Cyclist
range: cyclist
comment: Relazione tra Nascar Driver e Cyclist @it
comment: Relation between Nascar Driver and Cyclist
domain: nascar driver
type: ObjectProperty

television show
label: émission de télévision @fr
type: Class

disease
label: maladie @fr
type: Class

rugby player
label: joueur de rugby @fr
type: Class

american football league
type: Class

has Military Conflict
type: ObjectProperty
comment: Relation between Nascar Driver and Military Conflict
domain: nascar driver
range: military conflict
comment: Relazione tra Nascar Driver e Military Conflict @it

has Trade Union
comment: Relation between Nascar Driver and Trade Union
range: trade union
comment: Relazione tra Nascar Driver e Trade Union @it
type: ObjectProperty
domain: nascar driver

has World Heritage Site
range: World Heritage Site
domain: nascar driver
type: ObjectProperty
comment: Relation between Nascar Driver and World Heritage Site
comment: Relazione tra Nascar Driver e World Heritage Site @it

Ontology
extracted from: en.wikipedia.org
has author: Aldo Gangemi
has author: Andrea Giovanni Nuzzolese
extracted from: dbpedia.org
has intent: To represent the encyclopedic knowledge expressed by an object typed as NascarDriver
imports: cpannotationschema.owl
comment: NascarDriver Encyclopedic Knowledge Pattern
has author: Valentina Presutti

has Ethnic Group
range: ethnic group
domain: nascar driver
comment: Relazione tra Nascar Driver e Ethnic Group @it
type: ObjectProperty
comment: Relation between Nascar Driver and Ethnic Group

has Ski Area
comment: Relazione tra Nascar Driver e Ski Area @it
type: ObjectProperty
domain: nascar driver
range: ski area
comment: Relation between Nascar Driver and Ski Area

has American Football Team
comment: Relation between Nascar Driver and American Football Team
type: ObjectProperty
range: american football team
domain: nascar driver
comment: Relazione tra Nascar Driver e American Football Team @it

has Actor
comment: Relazione tra Nascar Driver e Actor @it
domain: nascar driver
type: ObjectProperty
range: actor
comment: Relation between Nascar Driver and Actor

has Record Label
comment: Relazione tra Nascar Driver e Record Label @it
type: ObjectProperty
comment: Relation between Nascar Driver and Record Label
domain: nascar driver
range: record label

actor
label: acteur @fr
type: Class
label: Schauspieler @de

american football player
type: Class
label: joueur de football américain @fr

has Drug
domain: nascar driver
range: drug
comment: Relation between Nascar Driver and Drug
type: ObjectProperty
comment: Relazione tra Nascar Driver e Drug @it

has Single
comment: Relation between Nascar Driver and Single
domain: nascar driver
type: ObjectProperty
range: single
comment: Relazione tra Nascar Driver e Single @it

cyclist
type: Class
label: cycliste @fr

stadium
label: stade @fr
type: Class

has Journalist
comment: Relazione tra Nascar Driver e Journalist @it
range: journalist
domain: nascar driver
comment: Relation between Nascar Driver and Journalist
type: ObjectProperty

has Newspaper
range: newspaper
type: ObjectProperty
domain: nascar driver
comment: Relazione tra Nascar Driver e Newspaper @it
comment: Relation between Nascar Driver and Newspaper

has Ice Hockey Player
type: ObjectProperty
range: ice hockey player
comment: Relation between Nascar Driver and Ice Hockey Player
domain: nascar driver
comment: Relazione tra Nascar Driver e Ice Hockey Player @it

has Soccer Club
domain: nascar driver
comment: Relation between Nascar Driver and Soccer Club
comment: Relazione tra Nascar Driver e Soccer Club @it
range: soccer club
type: ObjectProperty

has Game
type: ObjectProperty
domain: nascar driver
comment: Relation between Nascar Driver and Game
comment: Relazione tra Nascar Driver e Game @it
range: game

has College Coach
type: ObjectProperty
range: college coach
domain: nascar driver
comment: Relazione tra Nascar Driver e College Coach @it
comment: Relation between Nascar Driver and College Coach

has Hotel
domain: nascar driver
comment: Relazione tra Nascar Driver e Hotel @it
type: ObjectProperty
range: hotel
comment: Relation between Nascar Driver and Hotel

has Chemical Compound
comment: Relation between Nascar Driver and Chemical Compound
comment: Relazione tra Nascar Driver e Chemical Compound @it
type: ObjectProperty
domain: nascar driver
range: chemical compound

Axiom
annotated target: after
matching quantification: 1
annotated source: has Baseball Player

has Saint
comment: Relation between Nascar Driver and Saint
comment: Relazione tra Nascar Driver e Saint @it
domain: nascar driver
type: ObjectProperty
range: saint

basketball league
type: Class
label: ligue de basketball @fr

wrestler
type: Class
label: lutteur @fr

has Mountain Range
type: ObjectProperty
comment: Relation between Nascar Driver and Mountain Range
domain: nascar driver
comment: Relazione tra Nascar Driver e Mountain Range @it
range: mountain range

has Continent
comment: Relation between Nascar Driver and Continent
range: continent
domain: nascar driver
comment: Relazione tra Nascar Driver e Continent @it
type: ObjectProperty

flowering plant
type: Class
label: angiospermes @fr

has Disease
domain: nascar driver
range: disease
type: ObjectProperty
comment: Relation between Nascar Driver and Disease
comment: Relazione tra Nascar Driver e Disease @it

has Wine Region
comment: Relazione tra Nascar Driver e Wine Region @it
range: wine region
type: ObjectProperty
comment: Relation between Nascar Driver and Wine Region
domain: nascar driver

senator
type: Class
label: sénateur @fr

saint
type: Class

has Wrestler
domain: nascar driver
comment: Relazione tra Nascar Driver e Wrestler @it
range: wrestler
type: ObjectProperty
comment: Relation between Nascar Driver and Wrestler

has Rugby Player
type: ObjectProperty
comment: Relazione tra Nascar Driver e Rugby Player @it
comment: Relation between Nascar Driver and Rugby Player
range: rugby player
domain: nascar driver

comedian
type: Class
label: comédien @fr

has Island
comment: Relation between Nascar Driver and Island
range: island
comment: Relazione tra Nascar Driver e Island @it
type: ObjectProperty
domain: nascar driver

song
label: chanson @fr
type: Class

newspaper
type: Class
label: journal @fr

game
type: Class
label: jeu @fr

has Basketball Team
comment: Relation between Nascar Driver and Basketball Team
type: ObjectProperty
range: basketball team
domain: nascar driver
comment: Relazione tra Nascar Driver e Basketball Team @it

protected area
label: aire protégée @fr
label: προστατευμένη περιοχή @el
type: Class

road
type: Class
label: route @fr

has Television Episode
type: ObjectProperty
comment: Relazione tra Nascar Driver e Television Episode @it
domain: nascar driver
comment: Relation between Nascar Driver and Television Episode
range: television episode

boxer
label: boxeur @fr
type: Class

book
label: książka @pl
label: llibre @ca
label: βιβλίο @el
label: livre @fr
type: Class

Axiom
matching quantification: 19
annotated target: after
annotated source: has Formula One Racer

has Comedian
range: comedian
domain: nascar driver
comment: Relation between Nascar Driver and Comedian
type: ObjectProperty
comment: Relazione tra Nascar Driver e Comedian @it

World Heritage Site
type: Class
label: site du patrimoine mondial @fr

has Olympics
domain: nascar driver
type: ObjectProperty
range: olympics
comment: Relation between Nascar Driver and Olympics
comment: Relazione tra Nascar Driver e Olympics @it

has Band
comment: Relazione tra Nascar Driver e Band @it
type: ObjectProperty
range: Band
domain: nascar driver
comment: Relation between Nascar Driver and Band

ski area
label: domaine skiable @fr
type: Class

has Lake
comment: Relazione tra Nascar Driver e Lake @it
comment: Relation between Nascar Driver and Lake
domain: nascar driver
range: lake
type: ObjectProperty

non-profit organisation
label: organisation à but non lucratif @fr
type: Class

has Beverage
domain: nascar driver
comment: Relation between Nascar Driver and Beverage
range: beverage
type: ObjectProperty
comment: Relazione tra Nascar Driver e Beverage @it

lake
type: Class
label: lac @fr

has School
domain: nascar driver
type: ObjectProperty
comment: Relation between Nascar Driver and School
range: school
comment: Relazione tra Nascar Driver e School @it

has Military Unit
range: military unit
domain: nascar driver
comment: Relation between Nascar Driver and Military Unit
type: ObjectProperty
comment: Relazione tra Nascar Driver e Military Unit @it

has Military Person
type: ObjectProperty
range: military person
domain: nascar driver
comment: Relation between Nascar Driver and Military Person
comment: Relazione tra Nascar Driver e Military Person @it

has Video Game
related match: years
comment: Relazione tra Nascar Driver e Video Game @it
comment: Relation between Nascar Driver and Video Game
domain: nascar driver
range: video game
type: ObjectProperty

has Album
type: ObjectProperty
domain: nascar driver
comment: Relazione tra Nascar Driver e Album @it
comment: Relation between Nascar Driver and Album
range: album

wine region
label: région viticole @fr
type: Class

weapon
label: arme @fr
type: Class

has Baseball Player
related match: after
comment: Relazione tra Nascar Driver e Baseball Player @it
range: baseball player
type: ObjectProperty
comment: Relation between Nascar Driver and Baseball Player
domain: nascar driver

drug
type: Class
label: médicament @fr

has Basketball League
range: basketball league
comment: Relation between Nascar Driver and Basketball League
type: ObjectProperty
comment: Relazione tra Nascar Driver e Basketball League @it
domain: nascar driver

has Hospital
type: ObjectProperty
domain: nascar driver
comment: Relation between Nascar Driver and Hospital
comment: Relazione tra Nascar Driver e Hospital @it
range: hospital

has Formula One Racer
related match: after
related match: years
related match: before
type: ObjectProperty
range: Formula One racer
domain: nascar driver
comment: Relazione tra Nascar Driver e Formula One Racer @it
comment: Relation between Nascar Driver and Formula One Racer

Axiom
annotated source: has Village
annotated target: birthplace
matching quantification: 1

has Film
comment: Relation between Nascar Driver and Film
comment: Relazione tra Nascar Driver e Film @it
type: ObjectProperty
range: film
domain: nascar driver

magazine
type: Class
label: περιοδικό @el

has American Football League
comment: Relazione tra Nascar Driver e American Football League @it
type: ObjectProperty
domain: nascar driver
comment: Relation between Nascar Driver and American Football League
range: american football league

school
type: Class
label: école @fr

museum
type: Class
label: musée @fr

has Airport
domain: nascar driver
comment: Relation between Nascar Driver and Airport
range: airport
comment: Relazione tra Nascar Driver e Airport @it
type: ObjectProperty

fish
label: poisson @fr
type: Class

tennis player
type: Class
label: joueur de tennis @fr

has Ice Hockey League
domain: nascar driver
comment: Relazione tra Nascar Driver e Ice Hockey League @it
range: ice hockey league
type: ObjectProperty
comment: Relation between Nascar Driver and Ice Hockey League

video game
label: jeux vidéo @fr
type: Class

trade union
label: syndicat professionnel @fr
type: Class

has Comics Character
domain: nascar driver
comment: Relazione tra Nascar Driver e Comics Character @it
type: ObjectProperty
comment: Relation between Nascar Driver and Comics Character
range: comics character

has Village
range: village
comment: Relazione tra Nascar Driver e Village @it
comment: Relation between Nascar Driver and Village
type: ObjectProperty
domain: nascar driver
related match: birthplace

military person
label: militaire @fr
type: Class

currency
type: Class
label: devise @fr

has Book
range: book
type: ObjectProperty
domain: nascar driver
comment: Relazione tra Nascar Driver e Book @it
comment: Relation between Nascar Driver and Book

historic place
type: Class
label: site historique @fr

has Non- Profit Organisation
comment: Relation between Nascar Driver and Non- Profit Organisation
domain: nascar driver
type: ObjectProperty
range: non-profit organisation
comment: Relazione tra Nascar Driver e Non- Profit Organisation @it

hospital
type: Class
label: hôpital @fr

has Model
range: model
comment: Relation between Nascar Driver and Model
comment: Relazione tra Nascar Driver e Model @it
domain: nascar driver
type: ObjectProperty

anatomical structure
type: Class
label: structure anatomique @fr

sport
type: Class

has Mammal
range: mammal
comment: Relation between Nascar Driver and Mammal
comment: Relazione tra Nascar Driver e Mammal @it
type: ObjectProperty
domain: nascar driver

has Tennis Player
domain: nascar driver
type: ObjectProperty
comment: Relazione tra Nascar Driver e Tennis Player @it
comment: Relation between Nascar Driver and Tennis Player
range: tennis player

has Museum
type: ObjectProperty
comment: Relation between Nascar Driver and Museum
domain: nascar driver
range: museum
comment: Relazione tra Nascar Driver e Museum @it

single
type: Class

Band
label: groupe de musique @fr
type: Class
label: Musikgruppe @de
label: banda @pt

university
type: Class
label: université @fr
label: πανεπιστήμιο @el

auto racing league
type: Class
label: la ligue de course automobile @fr

has Boxer
type: ObjectProperty
domain: nascar driver
comment: Relazione tra Nascar Driver e Boxer @it
comment: Relation between Nascar Driver and Boxer
range: boxer

continent
label: ήπειρος @el
type: Class

ethnic group
type: Class
label: groupe ethnique @fr

has President
comment: Relazione tra Nascar Driver e President @it
comment: Relation between Nascar Driver and President
domain: nascar driver
type: ObjectProperty
range: president

has Radio Station
comment: Relazione tra Nascar Driver e Radio Station @it
type: ObjectProperty
domain: nascar driver
range: radio station
comment: Relation between Nascar Driver and Radio Station

president
type: Class
label: président @fr

album
type: Class
label: Album @de

has Weapon
domain: nascar driver
type: ObjectProperty
comment: Relation between Nascar Driver and Weapon
range: weapon
comment: Relazione tra Nascar Driver e Weapon @it

has Writer
range: writer
domain: nascar driver
comment: Relazione tra Nascar Driver e Writer @it
type: ObjectProperty
comment: Relation between Nascar Driver and Writer

has Soccer Player
comment: Relation between Nascar Driver and Soccer Player
range: soccer player
domain: nascar driver
comment: Relazione tra Nascar Driver e Soccer Player @it
type: ObjectProperty

Axiom
matching quantification: 1
annotated target: years
annotated source: has Formula One Racer

hotel
label: hôtel @fr
type: Class

has Stadium
type: ObjectProperty
range: stadium
comment: Relation between Nascar Driver and Stadium
comment: Relazione tra Nascar Driver e Stadium @it
domain: nascar driver

military unit
type: Class
label: unité militaire @fr

college coach
label: entraîneur universitaire @fr
type: Class

television episode
type: Class
label: épisode télévisé @fr

basketball team
type: Class

village
label: χωριό @el
type: Class

has Airline
range: airline
type: ObjectProperty
domain: nascar driver
comment: Relation between Nascar Driver and Airline
comment: Relazione tra Nascar Driver e Airline @it

has Film Festival
type: ObjectProperty
range: film festival
domain: nascar driver
comment: Relazione tra Nascar Driver e Film Festival @it
comment: Relation between Nascar Driver and Film Festival

ice hockey league
label: ligue d'hockey sur glace @fr
type: Class

soccer club
label: club de football @fr
type: Class

music genre
label: genre musical @fr
label: género musical @pt
type: Class

has Aircraft
type: ObjectProperty
comment: Relation between Nascar Driver and Aircraft
comment: Relazione tra Nascar Driver e Aircraft @it
domain: nascar driver
range: aircraft

writer
type: Class
label: écrivain @fr

record label
type: Class
label: label discographique @fr

has Music Genre
comment: Relation between Nascar Driver and Music Genre
comment: Relazione tra Nascar Driver e Music Genre @it
type: ObjectProperty
range: music genre
domain: nascar driver

baseball player
label: joueur de baseball @fr
type: Class

office holder
type: Class
label: Amtsinhaber @de
label: titulaire @fr

military conflict
label: conflit militaire @fr
type: Class

website
type: Class
label: site web @fr
label: Ιστότοπος @el

model
label: mannequin @fr
type: Class

has Sport
type: ObjectProperty
range: sport
domain: nascar driver
comment: Relation between Nascar Driver and Sport
comment: Relazione tra Nascar Driver e Sport @it

Axiom
annotated target: before
annotated source: has Formula One Racer
matching quantification: 17

has Magazine
range: magazine
type: ObjectProperty
domain: nascar driver
comment: Relation between Nascar Driver and Magazine
comment: Relazione tra Nascar Driver e Magazine @it

film festival
label: festival du film @fr
type: Class

basketball player
label: joueur de basketball @fr
type: Class

has American Football Player
type: ObjectProperty
domain: nascar driver
range: american football player
comment: Relazione tra Nascar Driver e American Football Player @it
comment: Relation between Nascar Driver and American Football Player

has Flowering Plant
comment: Relation between Nascar Driver and Flowering Plant
comment: Relazione tra Nascar Driver e Flowering Plant @it
domain: nascar driver
type: ObjectProperty
range: flowering plant

ice hockey player
type: Class
label: joueur de hockey sur glace @fr

has Baseball League
range: baseball league
type: ObjectProperty
comment: Relation between Nascar Driver and Baseball League
comment: Relazione tra Nascar Driver e Baseball League @it
domain: nascar driver

has Road
comment: Relazione tra Nascar Driver e Road @it
type: ObjectProperty
comment: Relation between Nascar Driver and Road
domain: nascar driver
range: road

has Auto Racing League
comment: Relation between Nascar Driver and Auto Racing League
domain: nascar driver
comment: Relazione tra Nascar Driver e Auto Racing League @it
range: auto racing league
type: ObjectProperty

Grand Prix
label: grand prix @fr
type: Class

mountain range
type: Class
label: chaîne de montagne @fr

has Protected Area
range: protected area
comment: Relazione tra Nascar Driver e Protected Area @it
domain: nascar driver
comment: Relation between Nascar Driver and Protected Area
type: ObjectProperty

beverage
type: Class
label: boisson @fr

has Website
range: website
domain: nascar driver
comment: Relazione tra Nascar Driver e Website @it
type: ObjectProperty
comment: Relation between Nascar Driver and Website

has Basketball Player
type: ObjectProperty
domain: nascar driver
comment: Relazione tra Nascar Driver e Basketball Player @it
comment: Relation between Nascar Driver and Basketball Player
range: basketball player

aircraft
label: αεροσκάφος @el
type: Class
label: avion @fr

hockey team
type: Class
label: équipe de hockey @fr

soccer player
label: joueur de football @fr
type: Class

has Grand Prix
comment: Relation between Nascar Driver and Grand Prix
comment: Relazione tra Nascar Driver e Grand Prix @it
type: ObjectProperty
domain: nascar driver
range: Grand Prix

Axiom
matching quantification: 2
annotated target: years
annotated source: has Video Game

has Fish
comment: Relation between Nascar Driver and Fish
domain: nascar driver
comment: Relazione tra Nascar Driver e Fish @it
range: fish
type: ObjectProperty

airline
type: Class
label: compagnie aérienne @fr

olympics
type: Class
label: Jeux Olympiques @fr

has Historic Place
type: ObjectProperty
comment: Relation between Nascar Driver and Historic Place
range: historic place
domain: nascar driver
comment: Relazione tra Nascar Driver e Historic Place @it

baseball league
type: Class
label: ligue de baseball @fr

has Song
domain: nascar driver
range: song
type: ObjectProperty
comment: Relation between Nascar Driver and Song
comment: Relazione tra Nascar Driver e Song @it

has Office Holder
type: ObjectProperty
range: office holder
comment: Relation between Nascar Driver and Office Holder
comment: Relazione tra Nascar Driver e Office Holder @it
domain: nascar driver

has Broadcast
comment: Relazione tra Nascar Driver e Broadcast @it
comment: Relation between Nascar Driver and Broadcast
type: ObjectProperty
range: broadcast
domain: nascar driver

golf player
label: golfeur @fr
type: Class

nascar driver
type: Class
label: pilote de la nascar @fr

journalist
type: Class
label: journaliste @fr

has Currency
comment: Relazione tra Nascar Driver e Currency @it
domain: nascar driver
comment: Relation between Nascar Driver and Currency
range: currency
type: ObjectProperty

broadcast
label: Émission de télévision @fr
type: Class

film
type: Class
label: ταινία @el

has University
comment: Relazione tra Nascar Driver e University @it
type: ObjectProperty
domain: nascar driver
range: university
comment: Relation between Nascar Driver and University

mammal
label: mammifère @fr
type: Class

has Anatomical Structure
domain: nascar driver
comment: Relation between Nascar Driver and Anatomical Structure
type: ObjectProperty
range: anatomical structure
comment: Relazione tra Nascar Driver e Anatomical Structure @it

american football team
label: équipe américaine de football américain @fr
type: Class

island
label: île @fr
label: νησί @el
type: Class

comics character
type: Class
label: personnage de bandes dessinées @fr

has Senator
range: senator
domain: nascar driver
comment: Relazione tra Nascar Driver e Senator @it
type: ObjectProperty
comment: Relation between Nascar Driver and Senator

chemical compound
label: produit chimique @fr
type: Class

Formula One racer
type: Class
label: pilote de formule 1 @fr

radio station
type: Class
label: station de radio @fr

has Golf Player
domain: nascar driver
comment: Relazione tra Nascar Driver e Golf Player @it
type: ObjectProperty
range: golf player
comment: Relation between Nascar Driver and Golf Player

has Hockey Team
comment: Relation between Nascar Driver and Hockey Team
type: ObjectProperty
domain: nascar driver
comment: Relazione tra Nascar Driver e Hockey Team @it
range: hockey team

musical artist
label: artista musical @pt
type: Class
label: musicien @fr

airport
type: Class
label: Flughafen @de
label: aéroport @fr