television show
label: émission de télévision @fr
type: Class

has Protein
domain: national collegiate athletic association athlete
comment: Relazione tra National Collegiate Athletic Association Athlete e Protein @it
type: ObjectProperty
range: protein
comment: Relation between National Collegiate Athletic Association Athlete and Protein

fictional character
type: Class
label: personnage de fiction @fr

disease
type: Class
label: maladie @fr

american football league
type: Class

has Species
domain: national collegiate athletic association athlete
comment: Relazione tra National Collegiate Athletic Association Athlete e Species @it
comment: Relation between National Collegiate Athletic Association Athlete and Species
range: species
type: ObjectProperty

actor
label: Schauspieler @de
type: Class
label: acteur @fr

american football player
type: Class
label: joueur de football américain @fr

stadium
type: Class
label: stade @fr

soccer league
label: ligue de football @fr
type: Class

national collegiate athletic association athlete
label: athlète de la national collegiate athletic association @fr
type: Class

has Olympics
comment: Relazione tra National Collegiate Athletic Association Athlete e Olympics @it
comment: Relation between National Collegiate Athletic Association Athlete and Olympics
domain: national collegiate athletic association athlete
type: ObjectProperty
range: olympics

has Senator
comment: Relazione tra National Collegiate Athletic Association Athlete e Senator @it
domain: national collegiate athletic association athlete
comment: Relation between National Collegiate Athletic Association Athlete and Senator
type: ObjectProperty
range: senator

has Station
type: ObjectProperty
comment: Relation between National Collegiate Athletic Association Athlete and Station
range: station
domain: national collegiate athletic association athlete
comment: Relazione tra National Collegiate Athletic Association Athlete e Station @it

has Beverage
range: beverage
domain: national collegiate athletic association athlete
comment: Relation between National Collegiate Athletic Association Athlete and Beverage
comment: Relazione tra National Collegiate Athletic Association Athlete e Beverage @it
type: ObjectProperty

species
type: Class
label: espèce @fr

has Drug
comment: Relazione tra National Collegiate Athletic Association Athlete e Drug @it
domain: national collegiate athletic association athlete
range: drug
comment: Relation between National Collegiate Athletic Association Athlete and Drug
type: ObjectProperty

senator
type: Class
label: sénateur @fr

has Legislature
type: ObjectProperty
comment: Relation between National Collegiate Athletic Association Athlete and Legislature
comment: Relazione tra National Collegiate Athletic Association Athlete e Legislature @it
range: legislature
domain: national collegiate athletic association athlete

has Disease
domain: national collegiate athletic association athlete
type: ObjectProperty
comment: Relation between National Collegiate Athletic Association Athlete and Disease
comment: Relazione tra National Collegiate Athletic Association Athlete e Disease @it
range: disease

has Ice Hockey Player
domain: national collegiate athletic association athlete
range: ice hockey player
comment: Relazione tra National Collegiate Athletic Association Athlete e Ice Hockey Player @it
comment: Relation between National Collegiate Athletic Association Athlete and Ice Hockey Player
type: ObjectProperty

newspaper
type: Class
label: journal @fr

protected area
type: Class
label: προστατευμένη περιοχή @el
label: aire protégée @fr

has Museum
comment: Relation between National Collegiate Athletic Association Athlete and Museum
range: museum
comment: Relazione tra National Collegiate Athletic Association Athlete e Museum @it
type: ObjectProperty
domain: national collegiate athletic association athlete

has Soccer Club
range: soccer club
type: ObjectProperty
comment: Relazione tra National Collegiate Athletic Association Athlete e Soccer Club @it
comment: Relation between National Collegiate Athletic Association Athlete and Soccer Club
domain: national collegiate athletic association athlete

has Currency
comment: Relation between National Collegiate Athletic Association Athlete and Currency
type: ObjectProperty
range: currency
domain: national collegiate athletic association athlete
comment: Relazione tra National Collegiate Athletic Association Athlete e Currency @it

language
label: langage @fr
type: Class

station
type: Class

non-profit organisation
type: Class
label: organisation à but non lucratif @fr

has Golf Player
comment: Relation between National Collegiate Athletic Association Athlete and Golf Player
comment: Relazione tra National Collegiate Athletic Association Athlete e Golf Player @it
domain: national collegiate athletic association athlete
type: ObjectProperty
range: golf player

canadian football league
type: Class

software
label: logiciel @fr
type: Class

has Hospital
range: hospital
comment: Relation between National Collegiate Athletic Association Athlete and Hospital
comment: Relazione tra National Collegiate Athletic Association Athlete e Hospital @it
domain: national collegiate athletic association athlete
type: ObjectProperty

company
label: entreprise @fr
type: Class

drug
type: Class
label: médicament @fr

has Broadcast
comment: Relazione tra National Collegiate Athletic Association Athlete e Broadcast @it
domain: national collegiate athletic association athlete
type: ObjectProperty
comment: Relation between National Collegiate Athletic Association Athlete and Broadcast
range: broadcast

has Language
comment: Relazione tra National Collegiate Athletic Association Athlete e Language @it
domain: national collegiate athletic association athlete
type: ObjectProperty
comment: Relation between National Collegiate Athletic Association Athlete and Language
range: language

magazine
type: Class
label: περιοδικό @el

lacrosse league
label: ligue de crosse @fr
type: Class

museum
type: Class
label: musée @fr

tennis player
type: Class
label: joueur de tennis @fr

has Magazine
type: ObjectProperty
comment: Relation between National Collegiate Athletic Association Athlete and Magazine
comment: Relazione tra National Collegiate Athletic Association Athlete e Magazine @it
domain: national collegiate athletic association athlete
range: magazine

award
type: Class
label: récompense @fr

has Protected Area
domain: national collegiate athletic association athlete
range: protected area
comment: Relazione tra National Collegiate Athletic Association Athlete e Protected Area @it
type: ObjectProperty
comment: Relation between National Collegiate Athletic Association Athlete and Protected Area

currency
label: devise @fr
type: Class

historic place
type: Class
label: site historique @fr

hospital
label: hôpital @fr
type: Class

has Soccer Manager
range: soccer manager
comment: Relation between National Collegiate Athletic Association Athlete and Soccer Manager
comment: Relazione tra National Collegiate Athletic Association Athlete e Soccer Manager @it
domain: national collegiate athletic association athlete
type: ObjectProperty

Ontology
extracted from: en.wikipedia.org
extracted from: dbpedia.org
has author: Valentina Presutti
imports: cpannotationschema.owl
has author: Aldo Gangemi
has author: Andrea Giovanni Nuzzolese
has intent: To represent the encyclopedic knowledge expressed by an object typed as NationalCollegiateAthleticAssociationAthlete
comment: NationalCollegiateAthleticAssociationAthlete Encyclopedic Knowledge Pattern

has Lacrosse League
type: ObjectProperty
comment: Relation between National Collegiate Athletic Association Athlete and Lacrosse League
comment: Relazione tra National Collegiate Athletic Association Athlete e Lacrosse League @it
domain: national collegiate athletic association athlete
range: lacrosse league

has American Football Player
related match: after
related match: before
domain: national collegiate athletic association athlete
type: ObjectProperty
comment: Relation between National Collegiate Athletic Association Athlete and American Football Player
range: american football player
comment: Relazione tra National Collegiate Athletic Association Athlete e American Football Player @it

has Military Unit
comment: Relation between National Collegiate Athletic Association Athlete and Military Unit
comment: Relazione tra National Collegiate Athletic Association Athlete e Military Unit @it
domain: national collegiate athletic association athlete
range: military unit
type: ObjectProperty

Band
label: groupe de musique @fr
type: Class
label: Musikgruppe @de
label: banda @pt

has Fictional Character
range: fictional character
type: ObjectProperty
comment: Relation between National Collegiate Athletic Association Athlete and Fictional Character
comment: Relazione tra National Collegiate Athletic Association Athlete e Fictional Character @it
domain: national collegiate athletic association athlete

town
label: ville @fr
type: Class

has Ice Hockey League
comment: Relazione tra National Collegiate Athletic Association Athlete e Ice Hockey League @it
range: ice hockey league
comment: Relation between National Collegiate Athletic Association Athlete and Ice Hockey League
domain: national collegiate athletic association athlete
type: ObjectProperty

has Canadian Football Team
domain: national collegiate athletic association athlete
type: ObjectProperty
range: canadian football team
comment: Relazione tra National Collegiate Athletic Association Athlete e Canadian Football Team @it
comment: Relation between National Collegiate Athletic Association Athlete and Canadian Football Team

protein
label: protéine @fr
type: Class

continent
label: ήπειρος @el
type: Class

has Town
domain: national collegiate athletic association athlete
comment: Relation between National Collegiate Athletic Association Athlete and Town
range: town
comment: Relazione tra National Collegiate Athletic Association Athlete e Town @it
type: ObjectProperty

ethnic group
label: groupe ethnique @fr
type: Class

has Baseball League
comment: Relazione tra National Collegiate Athletic Association Athlete e Baseball League @it
comment: Relation between National Collegiate Athletic Association Athlete and Baseball League
range: baseball league
domain: national collegiate athletic association athlete
type: ObjectProperty

has Film
domain: national collegiate athletic association athlete
range: film
comment: Relazione tra National Collegiate Athletic Association Athlete e Film @it
comment: Relation between National Collegiate Athletic Association Athlete and Film
type: ObjectProperty

president
type: Class
label: président @fr

has President
range: president
domain: national collegiate athletic association athlete
comment: Relation between National Collegiate Athletic Association Athlete and President
comment: Relazione tra National Collegiate Athletic Association Athlete e President @it
type: ObjectProperty

has Soccer Player
domain: national collegiate athletic association athlete
type: ObjectProperty
range: soccer player
comment: Relazione tra National Collegiate Athletic Association Athlete e Soccer Player @it
comment: Relation between National Collegiate Athletic Association Athlete and Soccer Player

has Actor
comment: Relation between National Collegiate Athletic Association Athlete and Actor
comment: Relazione tra National Collegiate Athletic Association Athlete e Actor @it
range: actor
domain: national collegiate athletic association athlete
type: ObjectProperty

has Newspaper
range: newspaper
comment: Relation between National Collegiate Athletic Association Athlete and Newspaper
type: ObjectProperty
comment: Relazione tra National Collegiate Athletic Association Athlete e Newspaper @it
domain: national collegiate athletic association athlete

military unit
type: Class
label: unité militaire @fr

has Canadian Football League
type: ObjectProperty
domain: national collegiate athletic association athlete
comment: Relazione tra National Collegiate Athletic Association Athlete e Canadian Football League @it
range: canadian football league
comment: Relation between National Collegiate Athletic Association Athlete and Canadian Football League

soccer manager
label: entraîneur de football @fr
type: Class

village
label: χωριό @el
type: Class

Axiom
annotated target: after
matching quantification: 3
annotated source: has American Football Player

ice hockey league
type: Class
label: ligue d'hockey sur glace @fr

has Military Conflict
comment: Relation between National Collegiate Athletic Association Athlete and Military Conflict
domain: national collegiate athletic association athlete
comment: Relazione tra National Collegiate Athletic Association Athlete e Military Conflict @it
type: ObjectProperty
range: military conflict

canadian football team
type: Class
label: équipe canadienne de football américain @fr

soccer club
label: club de football @fr
type: Class

has Non- Profit Organisation
comment: Relation between National Collegiate Athletic Association Athlete and Non- Profit Organisation
type: ObjectProperty
domain: national collegiate athletic association athlete
range: non-profit organisation
comment: Relazione tra National Collegiate Athletic Association Athlete e Non- Profit Organisation @it

has Continent
comment: Relazione tra National Collegiate Athletic Association Athlete e Continent @it
range: continent
domain: national collegiate athletic association athlete
comment: Relation between National Collegiate Athletic Association Athlete and Continent
type: ObjectProperty

writer
type: Class
label: écrivain @fr

has Village
type: ObjectProperty
comment: Relazione tra National Collegiate Athletic Association Athlete e Village @it
domain: national collegiate athletic association athlete
range: village
comment: Relation between National Collegiate Athletic Association Athlete and Village

baseball player
label: joueur de baseball @fr
type: Class

office holder
label: titulaire @fr
label: Amtsinhaber @de
type: Class

military conflict
label: conflit militaire @fr
type: Class

has Award
domain: national collegiate athletic association athlete
comment: Relazione tra National Collegiate Athletic Association Athlete e Award @it
comment: Relation between National Collegiate Athletic Association Athlete and Award
range: award
type: ObjectProperty

website
label: Ιστότοπος @el
label: site web @fr
type: Class

has Stadium
comment: Relazione tra National Collegiate Athletic Association Athlete e Stadium @it
domain: national collegiate athletic association athlete
range: stadium
type: ObjectProperty
comment: Relation between National Collegiate Athletic Association Athlete and Stadium

has Website
comment: Relazione tra National Collegiate Athletic Association Athlete e Website @it
comment: Relation between National Collegiate Athletic Association Athlete and Website
domain: national collegiate athletic association athlete
range: website
type: ObjectProperty

has Journalist
comment: Relazione tra National Collegiate Athletic Association Athlete e Journalist @it
comment: Relation between National Collegiate Athletic Association Athlete and Journalist
domain: national collegiate athletic association athlete
range: journalist
type: ObjectProperty

has Tennis Player
range: tennis player
type: ObjectProperty
comment: Relazione tra National Collegiate Athletic Association Athlete e Tennis Player @it
domain: national collegiate athletic association athlete
comment: Relation between National Collegiate Athletic Association Athlete and Tennis Player

ice hockey player
type: Class
label: joueur de hockey sur glace @fr

Axiom
matching quantification: 7
annotated target: before
annotated source: has American Football Player

has Baseball Player
comment: Relation between National Collegiate Athletic Association Athlete and Baseball Player
comment: Relazione tra National Collegiate Athletic Association Athlete e Baseball Player @it
domain: national collegiate athletic association athlete
range: baseball player
type: ObjectProperty

has Software
comment: Relazione tra National Collegiate Athletic Association Athlete e Software @it
range: software
domain: national collegiate athletic association athlete
type: ObjectProperty
comment: Relation between National Collegiate Athletic Association Athlete and Software

beverage
label: boisson @fr
type: Class

has Television Show
range: television show
domain: national collegiate athletic association athlete
comment: Relazione tra National Collegiate Athletic Association Athlete e Television Show @it
type: ObjectProperty
comment: Relation between National Collegiate Athletic Association Athlete and Television Show

soccer player
type: Class
label: joueur de football @fr

has Musical Artist
range: musical artist
domain: national collegiate athletic association athlete
type: ObjectProperty
comment: Relation between National Collegiate Athletic Association Athlete and Musical Artist
comment: Relazione tra National Collegiate Athletic Association Athlete e Musical Artist @it

legislature
label: pouvoir législatif @fr
type: Class

olympics
type: Class
label: Jeux Olympiques @fr

baseball league
label: ligue de baseball @fr
type: Class

has Company
comment: Relation between National Collegiate Athletic Association Athlete and Company
domain: national collegiate athletic association athlete
range: company
comment: Relazione tra National Collegiate Athletic Association Athlete e Company @it
type: ObjectProperty

golf player
type: Class
label: golfeur @fr

journalist
type: Class
label: journaliste @fr

has Ethnic Group
range: ethnic group
type: ObjectProperty
domain: national collegiate athletic association athlete
comment: Relation between National Collegiate Athletic Association Athlete and Ethnic Group
comment: Relazione tra National Collegiate Athletic Association Athlete e Ethnic Group @it

has Bone
type: ObjectProperty
domain: national collegiate athletic association athlete
comment: Relation between National Collegiate Athletic Association Athlete and Bone
range: bone
comment: Relazione tra National Collegiate Athletic Association Athlete e Bone @it

broadcast
label: Émission de télévision @fr
type: Class

has Soccer League
range: soccer league
domain: national collegiate athletic association athlete
comment: Relazione tra National Collegiate Athletic Association Athlete e Soccer League @it
type: ObjectProperty
comment: Relation between National Collegiate Athletic Association Athlete and Soccer League

film
label: ταινία @el
type: Class

has Band
comment: Relation between National Collegiate Athletic Association Athlete and Band
type: ObjectProperty
comment: Relazione tra National Collegiate Athletic Association Athlete e Band @it
range: Band
domain: national collegiate athletic association athlete

american football team
label: équipe américaine de football américain @fr
type: Class

has Office Holder
domain: national collegiate athletic association athlete
range: office holder
comment: Relation between National Collegiate Athletic Association Athlete and Office Holder
comment: Relazione tra National Collegiate Athletic Association Athlete e Office Holder @it
type: ObjectProperty

has American Football Team
comment: Relation between National Collegiate Athletic Association Athlete and American Football Team
type: ObjectProperty
range: american football team
domain: national collegiate athletic association athlete
comment: Relazione tra National Collegiate Athletic Association Athlete e American Football Team @it

bone
type: Class
label: Knochen @de
label: os @fr

has Historic Place
range: historic place
comment: Relation between National Collegiate Athletic Association Athlete and Historic Place
type: ObjectProperty
comment: Relazione tra National Collegiate Athletic Association Athlete e Historic Place @it
domain: national collegiate athletic association athlete

musical artist
label: artista musical @pt
type: Class
label: musicien @fr

has Writer
comment: Relazione tra National Collegiate Athletic Association Athlete e Writer @it
comment: Relation between National Collegiate Athletic Association Athlete and Writer
range: writer
type: ObjectProperty
domain: national collegiate athletic association athlete

has American Football League
type: ObjectProperty
comment: Relation between National Collegiate Athletic Association Athlete and American Football League
range: american football league
domain: national collegiate athletic association athlete
comment: Relazione tra National Collegiate Athletic Association Athlete e American Football League @it