has Military Person
domain: olympic result
type: ObjectProperty
range: military person
comment: Relation between Olympic Result and Military Person
comment: Relazione tra Olympic Result e Military Person @it

television show
label: émission de télévision @fr
type: Class

has Nascar Driver
comment: Relazione tra Olympic Result e Nascar Driver @it
comment: Relation between Olympic Result and Nascar Driver
domain: olympic result
range: nascar driver
type: ObjectProperty

disease
label: maladie @fr
type: Class

cardinal
type: Class

has Legislature
type: ObjectProperty
domain: olympic result
comment: Relazione tra Olympic Result e Legislature @it
range: legislature
comment: Relation between Olympic Result and Legislature

rugby player
label: joueur de rugby @fr
type: Class

has Golf Player
comment: Relazione tra Olympic Result e Golf Player @it
range: golf player
comment: Relation between Olympic Result and Golf Player
domain: olympic result
type: ObjectProperty

has Criminal
comment: Relazione tra Olympic Result e Criminal @it
comment: Relation between Olympic Result and Criminal
type: ObjectProperty
domain: olympic result
range: criminal

actor
label: Schauspieler @de
type: Class
label: acteur @fr

american football player
type: Class
label: joueur de football américain @fr

has Member Of Parliament
comment: Relazione tra Olympic Result e Member Of Parliament @it
type: ObjectProperty
range: member of parliament
comment: Relation between Olympic Result and Member Of Parliament
domain: olympic result

stadium
label: stade @fr
type: Class

soccer league
label: ligue de football @fr
type: Class

has American Football Player
comment: Relazione tra Olympic Result e American Football Player @it
comment: Relation between Olympic Result and American Football Player
domain: olympic result
range: american football player
type: ObjectProperty

national collegiate athletic association athlete
label: athlète de la national collegiate athletic association @fr
type: Class

has Soccer League
comment: Relation between Olympic Result and Soccer League
range: soccer league
domain: olympic result
comment: Relazione tra Olympic Result e Soccer League @it
type: ObjectProperty

has Soccer Club
related match: club
type: ObjectProperty
comment: Relation between Olympic Result and Soccer Club
comment: Relazione tra Olympic Result e Soccer Club @it
range: soccer club
domain: olympic result

has Basketball Player
comment: Relazione tra Olympic Result e Basketball Player @it
type: ObjectProperty
range: basketball player
domain: olympic result
comment: Relation between Olympic Result and Basketball Player

has Administrative Region
domain: olympic result
comment: Relazione tra Olympic Result e Administrative Region @it
type: ObjectProperty
range: administrative region
comment: Relation between Olympic Result and Administrative Region

wrestler
type: Class
label: lutteur @fr

mayor
type: Class
label: maire @fr

criminal
label: criminel @fr
type: Class

has Tennis Player
domain: olympic result
comment: Relazione tra Olympic Result e Tennis Player @it
range: tennis player
type: ObjectProperty
comment: Relation between Olympic Result and Tennis Player

saint
type: Class

has Cardinal
domain: olympic result
range: cardinal
comment: Relazione tra Olympic Result e Cardinal @it
type: ObjectProperty
comment: Relation between Olympic Result and Cardinal

has Village
type: ObjectProperty
range: village
comment: Relazione tra Olympic Result e Village @it
domain: olympic result
comment: Relation between Olympic Result and Village

newspaper
type: Class
label: journal @fr

has Baseball League
comment: Relation between Olympic Result and Baseball League
comment: Relazione tra Olympic Result e Baseball League @it
range: baseball league
type: ObjectProperty
domain: olympic result

Ontology
imports: cpannotationschema.owl
has author: Aldo Gangemi
extracted from: en.wikipedia.org
has author: Valentina Presutti
has intent: To represent the encyclopedic knowledge expressed by an object typed as OlympicResult
has author: Andrea Giovanni Nuzzolese
comment: OlympicResult Encyclopedic Knowledge Pattern
extracted from: dbpedia.org

boxer
label: boxeur @fr
type: Class

judge
type: Class
label: juge @fr

has Military Conflict
comment: Relazione tra Olympic Result e Military Conflict @it
comment: Relation between Olympic Result and Military Conflict
type: ObjectProperty
range: military conflict
domain: olympic result

has Writer
range: writer
domain: olympic result
comment: Relation between Olympic Result and Writer
comment: Relazione tra Olympic Result e Writer @it
type: ObjectProperty

language
type: Class
label: langage @fr

has School
range: school
type: ObjectProperty
comment: Relazione tra Olympic Result e School @it
domain: olympic result
comment: Relation between Olympic Result and School

ski area
label: domaine skiable @fr
type: Class

has Hockey Team
range: hockey team
domain: olympic result
comment: Relazione tra Olympic Result e Hockey Team @it
comment: Relation between Olympic Result and Hockey Team
type: ObjectProperty

has Bone
comment: Relazione tra Olympic Result e Bone @it
type: ObjectProperty
range: bone
comment: Relation between Olympic Result and Bone
domain: olympic result

has Drug
type: ObjectProperty
domain: olympic result
comment: Relation between Olympic Result and Drug
range: drug
comment: Relazione tra Olympic Result e Drug @it

governor
type: Class
label: gouverneur @fr

company
label: entreprise @fr
type: Class

drug
label: médicament @fr
type: Class

administrative region
type: Class
label: région administrative @fr

has British Royalty
comment: Relazione tra Olympic Result e British Royalty @it
domain: olympic result
type: ObjectProperty
range: British royalty
comment: Relation between Olympic Result and British Royalty

school
type: Class
label: école @fr

has Scientist
type: ObjectProperty
comment: Relazione tra Olympic Result e Scientist @it
comment: Relation between Olympic Result and Scientist
range: scientist
domain: olympic result

tennis player
type: Class
label: joueur de tennis @fr

has Language
range: language
comment: Relation between Olympic Result and Language
domain: olympic result
comment: Relazione tra Olympic Result e Language @it
type: ObjectProperty

has Chemical Compound
comment: Relazione tra Olympic Result e Chemical Compound @it
comment: Relation between Olympic Result and Chemical Compound
range: chemical compound
type: ObjectProperty
domain: olympic result

has Saint
comment: Relazione tra Olympic Result e Saint @it
type: ObjectProperty
domain: olympic result
comment: Relation between Olympic Result and Saint
range: saint

military person
label: militaire @fr
type: Class

philosopher
type: Class
label: philosophe @fr

currency
label: devise @fr
type: Class

has Currency
domain: olympic result
range: currency
comment: Relation between Olympic Result and Currency
type: ObjectProperty
comment: Relazione tra Olympic Result e Currency @it

British royalty
label: royauté Britannique @fr
type: Class

has Actor
domain: olympic result
comment: Relation between Olympic Result and Actor
comment: Relazione tra Olympic Result e Actor @it
type: ObjectProperty
range: actor

has Airport
comment: Relation between Olympic Result and Airport
type: ObjectProperty
comment: Relazione tra Olympic Result e Airport @it
range: airport
domain: olympic result

sport
type: Class

cricketer
type: Class
label: joueur de cricket @fr

town
label: ville @fr
type: Class

university
label: πανεπιστήμιο @el
label: université @fr
type: Class

has Congressman
range: congressman
domain: olympic result
type: ObjectProperty
comment: Relation between Olympic Result and Congressman
comment: Relazione tra Olympic Result e Congressman @it

continent
type: Class
label: ήπειρος @el

has Philosopher
comment: Relazione tra Olympic Result e Philosopher @it
comment: Relation between Olympic Result and Philosopher
domain: olympic result
type: ObjectProperty
range: philosopher

has Newspaper
domain: olympic result
comment: Relazione tra Olympic Result e Newspaper @it
type: ObjectProperty
range: newspaper
comment: Relation between Olympic Result and Newspaper

Axiom
matching quantification: 7
annotated source: has Soccer Club
annotated target: club

ethnic group
label: groupe ethnique @fr
type: Class

has Website
domain: olympic result
comment: Relation between Olympic Result and Website
type: ObjectProperty
range: website
comment: Relazione tra Olympic Result e Website @it

president
label: président @fr
type: Class

has Journalist
comment: Relazione tra Olympic Result e Journalist @it
type: ObjectProperty
domain: olympic result
range: journalist
comment: Relation between Olympic Result and Journalist

has Stadium
type: ObjectProperty
comment: Relation between Olympic Result and Stadium
range: stadium
domain: olympic result
comment: Relazione tra Olympic Result e Stadium @it

college coach
type: Class
label: entraîneur universitaire @fr

has Disease
domain: olympic result
type: ObjectProperty
comment: Relation between Olympic Result and Disease
range: disease
comment: Relazione tra Olympic Result e Disease @it

soccer manager
label: entraîneur de football @fr
type: Class

village
type: Class
label: χωριό @el

ice hockey league
label: ligue d'hockey sur glace @fr
type: Class

has Mountain Range
domain: olympic result
comment: Relazione tra Olympic Result e Mountain Range @it
range: mountain range
type: ObjectProperty
comment: Relation between Olympic Result and Mountain Range

soccer club
label: club de football @fr
type: Class

has Film
type: ObjectProperty
comment: Relation between Olympic Result and Film
domain: olympic result
range: film
comment: Relazione tra Olympic Result e Film @it

writer
label: écrivain @fr
type: Class

has Ice Hockey League
domain: olympic result
type: ObjectProperty
comment: Relation between Olympic Result and Ice Hockey League
comment: Relazione tra Olympic Result e Ice Hockey League @it
range: ice hockey league

baseball player
type: Class
label: joueur de baseball @fr

office holder
label: titulaire @fr
label: Amtsinhaber @de
type: Class

military conflict
type: Class
label: conflit militaire @fr

has Ski Area
domain: olympic result
range: ski area
comment: Relazione tra Olympic Result e Ski Area @it
type: ObjectProperty
comment: Relation between Olympic Result and Ski Area

website
label: Ιστότοπος @el
label: site web @fr
type: Class

olympic result
label: résultat de Jeux Olympiques @fr
type: Class

has Badminton Player
domain: olympic result
range: badminton player
comment: Relazione tra Olympic Result e Badminton Player @it
type: ObjectProperty
comment: Relation between Olympic Result and Badminton Player

basketball player
type: Class
label: joueur de basketball @fr

has Governor
type: ObjectProperty
range: governor
comment: Relation between Olympic Result and Governor
comment: Relazione tra Olympic Result e Governor @it
domain: olympic result

has Mayor
type: ObjectProperty
range: mayor
comment: Relazione tra Olympic Result e Mayor @it
domain: olympic result
comment: Relation between Olympic Result and Mayor

mountain range
type: Class
label: chaîne de montagne @fr

has Soccer Manager
comment: Relation between Olympic Result and Soccer Manager
domain: olympic result
type: ObjectProperty
range: soccer manager
comment: Relazione tra Olympic Result e Soccer Manager @it

has Boxer
range: boxer
domain: olympic result
comment: Relation between Olympic Result and Boxer
comment: Relazione tra Olympic Result e Boxer @it
type: ObjectProperty

has Town
type: ObjectProperty
domain: olympic result
comment: Relation between Olympic Result and Town
range: town
comment: Relazione tra Olympic Result e Town @it

comics creator
type: Class
label: créateur de bandes dessinées @fr

has Wrestler
type: ObjectProperty
range: wrestler
domain: olympic result
comment: Relazione tra Olympic Result e Wrestler @it
comment: Relation between Olympic Result and Wrestler

has Baseball Player
comment: Relazione tra Olympic Result e Baseball Player @it
comment: Relation between Olympic Result and Baseball Player
domain: olympic result
range: baseball player
type: ObjectProperty

has University
domain: olympic result
comment: Relation between Olympic Result and University
range: university
comment: Relazione tra Olympic Result e University @it
type: ObjectProperty

has Television Show
type: ObjectProperty
comment: Relazione tra Olympic Result e Television Show @it
range: television show
domain: olympic result
comment: Relation between Olympic Result and Television Show

hockey team
label: équipe de hockey @fr
type: Class

scientist
label: Wissenschaftler @de
type: Class
label: scientifique @fr

has Judge
range: judge
domain: olympic result
type: ObjectProperty
comment: Relazione tra Olympic Result e Judge @it
comment: Relation between Olympic Result and Judge

legislature
type: Class
label: pouvoir législatif @fr

has Ethnic Group
comment: Relazione tra Olympic Result e Ethnic Group @it
type: ObjectProperty
domain: olympic result
comment: Relation between Olympic Result and Ethnic Group
range: ethnic group

badminton player
label: joueur de badminton @fr
type: Class

has Radio Station
type: ObjectProperty
range: radio station
domain: olympic result
comment: Relation between Olympic Result and Radio Station
comment: Relazione tra Olympic Result e Radio Station @it

has Island
range: island
type: ObjectProperty
domain: olympic result
comment: Relation between Olympic Result and Island
comment: Relazione tra Olympic Result e Island @it

baseball league
type: Class
label: ligue de baseball @fr

congressman
label: membre du Congrès @fr
type: Class

golf player
label: golfeur @fr
type: Class

nascar driver
type: Class
label: pilote de la nascar @fr

has Cricketer
comment: Relation between Olympic Result and Cricketer
range: cricketer
domain: olympic result
comment: Relazione tra Olympic Result e Cricketer @it
type: ObjectProperty

journalist
label: journaliste @fr
type: Class

has Sport
comment: Relation between Olympic Result and Sport
comment: Relazione tra Olympic Result e Sport @it
type: ObjectProperty
domain: olympic result
range: sport

has College Coach
domain: olympic result
type: ObjectProperty
comment: Relation between Olympic Result and College Coach
comment: Relazione tra Olympic Result e College Coach @it
range: college coach

has Gaelic Games Player
comment: Relation between Olympic Result and Gaelic Games Player
comment: Relazione tra Olympic Result e Gaelic Games Player @it
type: ObjectProperty
range: Gaelic games player
domain: olympic result

broadcast
label: Émission de télévision @fr
type: Class

has Company
domain: olympic result
type: ObjectProperty
range: company
comment: Relation between Olympic Result and Company
comment: Relazione tra Olympic Result e Company @it

film
label: ταινία @el
type: Class

has Formula One Racer
domain: olympic result
comment: Relazione tra Olympic Result e Formula One Racer @it
type: ObjectProperty
comment: Relation between Olympic Result and Formula One Racer
range: Formula One racer

has National Collegiate Athletic Association Athlete
range: national collegiate athletic association athlete
type: ObjectProperty
domain: olympic result
comment: Relation between Olympic Result and National Collegiate Athletic Association Athlete
comment: Relazione tra Olympic Result e National Collegiate Athletic Association Athlete @it

island
type: Class
label: νησί @el
label: île @fr

has Comics Creator
type: ObjectProperty
comment: Relation between Olympic Result and Comics Creator
domain: olympic result
comment: Relazione tra Olympic Result e Comics Creator @it
range: comics creator

has Continent
type: ObjectProperty
range: continent
domain: olympic result
comment: Relation between Olympic Result and Continent
comment: Relazione tra Olympic Result e Continent @it

has Rugby Player
comment: Relazione tra Olympic Result e Rugby Player @it
range: rugby player
domain: olympic result
comment: Relation between Olympic Result and Rugby Player
type: ObjectProperty

chemical compound
type: Class
label: produit chimique @fr

Formula One racer
type: Class
label: pilote de formule 1 @fr

Gaelic games player
label: joueur de sports gaéliques @fr
type: Class

radio station
type: Class
label: station de radio @fr

has Broadcast
comment: Relation between Olympic Result and Broadcast
range: broadcast
domain: olympic result
comment: Relazione tra Olympic Result e Broadcast @it
type: ObjectProperty

member of parliament
label: membre du Parlement @fr
type: Class

bone
type: Class
label: Knochen @de
label: os @fr

musical artist
label: artista musical @pt
type: Class
label: musicien @fr

has Musical Artist
domain: olympic result
range: musical artist
comment: Relazione tra Olympic Result e Musical Artist @it
comment: Relation between Olympic Result and Musical Artist
type: ObjectProperty

has Office Holder
type: ObjectProperty
range: office holder
comment: Relazione tra Olympic Result e Office Holder @it
domain: olympic result
comment: Relation between Olympic Result and Office Holder

airport
label: aéroport @fr
label: Flughafen @de
type: Class

has President
comment: Relation between Olympic Result and President
type: ObjectProperty
domain: olympic result
comment: Relazione tra Olympic Result e President @it
range: president