has Rugby Player
type: ObjectProperty
domain: philosopher
range: rugby player
comment: Relation between Philosopher and Rugby Player
comment: Relazione tra Philosopher e Rugby Player @it

television show
label: émission de télévision @fr
type: Class

has Supreme Court Of The United States Case
domain: philosopher
type: ObjectProperty
comment: Relation between Philosopher and Supreme Court Of The United States Case
comment: Relazione tra Philosopher e Supreme Court Of The United States Case @it
range: Supreme Court of the United States case

has Christian Bishop
comment: Relation between Philosopher and Christian Bishop
range: Christian Bishop
type: ObjectProperty
comment: Relazione tra Philosopher e Christian Bishop @it
domain: philosopher

automobile
type: Class

colour
type: Class
label: couleur @fr
label: χρώμα @el

Election
type: Class
label: élection @fr

has Mammal
range: mammal
comment: Relation between Philosopher and Mammal
type: ObjectProperty
domain: philosopher
comment: Relazione tra Philosopher e Mammal @it

has Congressman
comment: Relazione tra Philosopher e Congressman @it
range: congressman
type: ObjectProperty
domain: philosopher
comment: Relation between Philosopher and Congressman

has Award
comment: Relazione tra Philosopher e Award @it
comment: Relation between Philosopher and Award
domain: philosopher
type: ObjectProperty
range: award

has Mountain
domain: philosopher
comment: Relazione tra Philosopher e Mountain @it
comment: Relation between Philosopher and Mountain
range: mountain
type: ObjectProperty

has Military Unit
comment: Relation between Philosopher and Military Unit
range: military unit
type: ObjectProperty
comment: Relazione tra Philosopher e Military Unit @it
domain: philosopher

pope
label: pape @fr
type: Class

has Arachnid
comment: Relation between Philosopher and Arachnid
range: arachnid
type: ObjectProperty
domain: philosopher
comment: Relazione tra Philosopher e Arachnid @it

species
type: Class
label: espèce @fr

has Actor
type: ObjectProperty
domain: philosopher
range: actor
comment: Relazione tra Philosopher e Actor @it
comment: Relation between Philosopher and Actor

newspaper
type: Class
label: journal @fr

protected area
type: Class
label: προστατευμένη περιοχή @el
label: aire protégée @fr

game
label: jeu @fr
type: Class

road
type: Class
label: route @fr

boxer
label: boxeur @fr
type: Class

judge
label: juge @fr
type: Class

World Heritage Site
type: Class
label: site du patrimoine mondial @fr

has President
range: president
comment: Relation between Philosopher and President
comment: Relazione tra Philosopher e President @it
domain: philosopher
type: ObjectProperty

has Monarch
range: monarch
comment: Relazione tra Philosopher e Monarch @it
domain: philosopher
comment: Relation between Philosopher and Monarch
type: ObjectProperty

has Ambassador
range: ambassador
comment: Relation between Philosopher and Ambassador
type: ObjectProperty
comment: Relazione tra Philosopher e Ambassador @it
domain: philosopher

lake
label: lac @fr
type: Class

has Television Show
comment: Relazione tra Philosopher e Television Show @it
type: ObjectProperty
range: television show
comment: Relation between Philosopher and Television Show
domain: philosopher

has Member Of Parliament
type: ObjectProperty
range: member of parliament
domain: philosopher
comment: Relazione tra Philosopher e Member Of Parliament @it
comment: Relation between Philosopher and Member Of Parliament

arachnid
label: arachnides @fr
type: Class

has Military Person
comment: Relazione tra Philosopher e Military Person @it
type: ObjectProperty
domain: philosopher
comment: Relation between Philosopher and Military Person
range: military person

governor
label: gouverneur @fr
type: Class

has Bird
domain: philosopher
type: ObjectProperty
range: bird
comment: Relation between Philosopher and Bird
comment: Relazione tra Philosopher e Bird @it

river
type: Class
label: rivière @fr

school
label: école @fr
type: Class

fish
type: Class
label: poisson @fr

museum
label: musée @fr
type: Class

ship
label: navire @fr
type: Class

has Pope
type: ObjectProperty
range: pope
comment: Relazione tra Philosopher e Pope @it
comment: Relation between Philosopher and Pope
domain: philosopher

video game
label: jeux vidéo @fr
type: Class

Axiom
annotated target: title
annotated source: has College
matching quantification: 1

trade union
label: syndicat professionnel @fr
type: Class

currency
label: devise @fr
type: Class

British royalty
type: Class
label: royauté Britannique @fr

prime minister
label: premier ministre @fr
type: Class

has Road
range: road
comment: Relation between Philosopher and Road
domain: philosopher
comment: Relazione tra Philosopher e Road @it
type: ObjectProperty

Ontology
extracted from: dbpedia.org
has author: Valentina Presutti
extracted from: en.wikipedia.org
has intent: To represent the encyclopedic knowledge expressed by an object typed as Philosopher
has author: Andrea Giovanni Nuzzolese
imports: cpannotationschema.owl
comment: Philosopher Encyclopedic Knowledge Pattern
has author: Aldo Gangemi

has Park
type: ObjectProperty
range: park
comment: Relazione tra Philosopher e Park @it
domain: philosopher
comment: Relation between Philosopher and Park

historic place
label: site historique @fr
type: Class

hospital
type: Class
label: hôpital @fr

has School
comment: Relazione tra Philosopher e School @it
comment: Relation between Philosopher and School
domain: philosopher
range: school
type: ObjectProperty

lunar crater
label: cratère lunaire @fr
type: Class

has Grape
range: grape
domain: philosopher
comment: Relazione tra Philosopher e Grape @it
type: ObjectProperty
comment: Relation between Philosopher and Grape

has Musical Artist
comment: Relazione tra Philosopher e Musical Artist @it
range: musical artist
domain: philosopher
type: ObjectProperty
comment: Relation between Philosopher and Musical Artist
related match: students

has Village
domain: philosopher
range: village
comment: Relazione tra Philosopher e Village @it
type: ObjectProperty
comment: Relation between Philosopher and Village

has Journalist
comment: Relazione tra Philosopher e Journalist @it
type: ObjectProperty
domain: philosopher
range: journalist
comment: Relation between Philosopher and Journalist

has Historic Place
comment: Relation between Philosopher and Historic Place
type: ObjectProperty
domain: philosopher
comment: Relazione tra Philosopher e Historic Place @it
range: historic place

continent
type: Class
label: ήπειρος @el

has Airport
comment: Relation between Philosopher and Airport
type: ObjectProperty
range: airport
comment: Relazione tra Philosopher e Airport @it
domain: philosopher

has Basketball Team
domain: philosopher
type: ObjectProperty
comment: Relation between Philosopher and Basketball Team
comment: Relazione tra Philosopher e Basketball Team @it
range: basketball team

president
label: président @fr
type: Class

album
type: Class
label: Album @de

has Saint
domain: philosopher
comment: Relazione tra Philosopher e Saint @it
type: ObjectProperty
comment: Relation between Philosopher and Saint
range: saint
related match: influences
related match: influenced

military unit
label: unité militaire @fr
type: Class

basketball team
type: Class

music genre
type: Class
label: género musical @pt
label: genre musical @fr

has Insect
comment: Relazione tra Philosopher e Insect @it
range: insect
domain: philosopher
type: ObjectProperty
comment: Relation between Philosopher and Insect

has Automobile
domain: philosopher
range: automobile
comment: Relazione tra Philosopher e Automobile @it
comment: Relation between Philosopher and Automobile
type: ObjectProperty

record label
type: Class
label: label discographique @fr

has Criminal
type: ObjectProperty
comment: Relation between Philosopher and Criminal
comment: Relazione tra Philosopher e Criminal @it
domain: philosopher
range: criminal

has Brain
comment: Relazione tra Philosopher e Brain @it
range: brain
comment: Relation between Philosopher and Brain
domain: philosopher
type: ObjectProperty

architect
label: architecte @fr
type: Class

model
label: mannequin @fr
type: Class

ambassador
type: Class
label: ambassadeur @fr

has Museum
type: ObjectProperty
domain: philosopher
comment: Relation between Philosopher and Museum
comment: Relazione tra Philosopher e Museum @it
range: museum

has Historic Building
range: historic building
comment: Relazione tra Philosopher e Historic Building @it
type: ObjectProperty
comment: Relation between Philosopher and Historic Building
domain: philosopher

has Broadcast
domain: philosopher
range: broadcast
comment: Relation between Philosopher and Broadcast
comment: Relazione tra Philosopher e Broadcast @it
type: ObjectProperty

chancellor
label: chancelier @fr
type: Class

comics creator
label: créateur de bandes dessinées @fr
type: Class

has Legislature
comment: Relazione tra Philosopher e Legislature @it
range: legislature
domain: philosopher
comment: Relation between Philosopher and Legislature
type: ObjectProperty

soccer player
label: joueur de football @fr
type: Class

has Model
range: model
type: ObjectProperty
comment: Relazione tra Philosopher e Model @it
comment: Relation between Philosopher and Model
domain: philosopher

has Colour
type: ObjectProperty
range: colour
comment: Relazione tra Philosopher e Colour @it
domain: philosopher
comment: Relation between Philosopher and Colour

legislature
type: Class
label: pouvoir législatif @fr

has Film
type: ObjectProperty
range: film
comment: Relation between Philosopher and Film
domain: philosopher
comment: Relazione tra Philosopher e Film @it

airline
type: Class
label: compagnie aérienne @fr

monarch
type: Class
label: monarque @fr

congressman
label: membre du Congrès @fr
type: Class

has Sport
range: sport
comment: Relazione tra Philosopher e Sport @it
comment: Relation between Philosopher and Sport
type: ObjectProperty
domain: philosopher

has Video Game
comment: Relazione tra Philosopher e Video Game @it
range: video game
type: ObjectProperty
comment: Relation between Philosopher and Video Game
domain: philosopher

has Planet
range: planet
comment: Relation between Philosopher and Planet
domain: philosopher
type: ObjectProperty
comment: Relazione tra Philosopher e Planet @it

has Single
domain: philosopher
type: ObjectProperty
range: single
comment: Relazione tra Philosopher e Single @it
comment: Relation between Philosopher and Single

has Island
range: island
comment: Relation between Philosopher and Island
domain: philosopher
comment: Relazione tra Philosopher e Island @it
type: ObjectProperty

journalist
type: Class
label: journaliste @fr

insect
type: Class
label: insecte @fr

has Radio Station
type: ObjectProperty
domain: philosopher
range: radio station
comment: Relation between Philosopher and Radio Station
comment: Relazione tra Philosopher e Radio Station @it

film
type: Class
label: ταινία @el

has River
type: ObjectProperty
comment: Relation between Philosopher and River
range: river
comment: Relazione tra Philosopher e River @it
domain: philosopher

Supreme Court of the United States case
type: Class
label: cas juridique de la Cour suprême des États-Unis @fr

chemical compound
type: Class
label: produit chimique @fr

bird
type: Class
label: oiseau @fr

has Comedian
range: comedian
domain: philosopher
comment: Relazione tra Philosopher e Comedian @it
comment: Relation between Philosopher and Comedian
type: ObjectProperty

musical artist
label: musicien @fr
type: Class
label: artista musical @pt

fungus
type: Class
label: fungi @fr

has Website
comment: Relazione tra Philosopher e Website @it
range: website
type: ObjectProperty
comment: Relation between Philosopher and Website
domain: philosopher

has Newspaper
comment: Relation between Philosopher and Newspaper
type: ObjectProperty
comment: Relazione tra Philosopher e Newspaper @it
range: newspaper
domain: philosopher

park
type: Class
label: parc @fr

has Protected Area
type: ObjectProperty
comment: Relazione tra Philosopher e Protected Area @it
domain: philosopher
range: protected area
comment: Relation between Philosopher and Protected Area

brain
label: cerveau @fr
type: Class

cardinal
type: Class

rugby player
type: Class
label: joueur de rugby @fr

has Record Label
type: ObjectProperty
range: record label
comment: Relation between Philosopher and Record Label
domain: philosopher
comment: Relazione tra Philosopher e Record Label @it

has Trade Union
comment: Relazione tra Philosopher e Trade Union @it
range: trade union
comment: Relation between Philosopher and Trade Union
domain: philosopher
type: ObjectProperty

actor
label: acteur @fr
type: Class
label: Schauspieler @de

has Soccer Player
comment: Relazione tra Philosopher e Soccer Player @it
type: ObjectProperty
comment: Relation between Philosopher and Soccer Player
domain: philosopher
range: soccer player

has Currency
comment: Relation between Philosopher and Currency
range: currency
type: ObjectProperty
comment: Relazione tra Philosopher e Currency @it
domain: philosopher

has Senator
comment: Relation between Philosopher and Senator
comment: Relazione tra Philosopher e Senator @it
type: ObjectProperty
range: senator
domain: philosopher

mountain
label: Βουνό @el
label: montagne @fr
type: Class

criminal
type: Class
label: criminel @fr

has Prime Minister
domain: philosopher
type: ObjectProperty
range: prime minister
comment: Relation between Philosopher and Prime Minister
comment: Relazione tra Philosopher e Prime Minister @it
related match: before

has Chancellor
domain: philosopher
comment: Relation between Philosopher and Chancellor
type: ObjectProperty
comment: Relazione tra Philosopher e Chancellor @it
range: chancellor

saint
type: Class

senator
type: Class
label: sénateur @fr

comedian
type: Class
label: comédien @fr

has Mountain Range
comment: Relation between Philosopher and Mountain Range
comment: Relazione tra Philosopher e Mountain Range @it
domain: philosopher
type: ObjectProperty
range: mountain range

Axiom
annotated target: influenced
annotated source: has Saint
matching quantification: 1

has Governor
range: governor
comment: Relation between Philosopher and Governor
domain: philosopher
type: ObjectProperty
comment: Relazione tra Philosopher e Governor @it

shopping mall
type: Class
label: centre commercial @fr

has Election
domain: philosopher
comment: Relazione tra Philosopher e Election @it
range: Election
comment: Relation between Philosopher and Election
type: ObjectProperty

has Hospital
comment: Relation between Philosopher and Hospital
comment: Relazione tra Philosopher e Hospital @it
domain: philosopher
range: hospital
type: ObjectProperty

gridiron football player
type: Class
label: joueur de football américain gridiron @fr

non-profit organisation
label: organisation à but non lucratif @fr
type: Class

space station
type: Class
label: station spatiale @fr

has Judge
comment: Relation between Philosopher and Judge
comment: Relazione tra Philosopher e Judge @it
range: judge
type: ObjectProperty
domain: philosopher

has Comics Character
range: comics character
type: ObjectProperty
comment: Relazione tra Philosopher e Comics Character @it
domain: philosopher
comment: Relation between Philosopher and Comics Character

has Chemical Compound
comment: Relation between Philosopher and Chemical Compound
range: chemical compound
domain: philosopher
type: ObjectProperty
comment: Relazione tra Philosopher e Chemical Compound @it

has Cardinal
type: ObjectProperty
range: cardinal
comment: Relazione tra Philosopher e Cardinal @it
comment: Relation between Philosopher and Cardinal
domain: philosopher

has Music Festival
comment: Relation between Philosopher and Music Festival
type: ObjectProperty
domain: philosopher
comment: Relazione tra Philosopher e Music Festival @it
range: music festival

has Album
comment: Relazione tra Philosopher e Album @it
type: ObjectProperty
comment: Relation between Philosopher and Album
domain: philosopher
range: album

drug
type: Class
label: médicament @fr

magazine
type: Class
label: περιοδικό @el

has Game
domain: philosopher
comment: Relation between Philosopher and Game
comment: Relazione tra Philosopher e Game @it
range: game
type: ObjectProperty

military person
type: Class
label: militaire @fr

philosopher
label: philosophe @fr
type: Class

award
label: récompense @fr
type: Class

has Ship
comment: Relation between Philosopher and Ship
type: ObjectProperty
domain: philosopher
comment: Relazione tra Philosopher e Ship @it
range: ship

college
type: Class

has Nerve
range: nerve
comment: Relazione tra Philosopher e Nerve @it
comment: Relation between Philosopher and Nerve
domain: philosopher
type: ObjectProperty

sport
type: Class

has Continent
domain: philosopher
comment: Relation between Philosopher and Continent
type: ObjectProperty
range: continent
comment: Relazione tra Philosopher e Continent @it

cricketer
type: Class
label: joueur de cricket @fr

single
type: Class

nerve
label: nerf @fr
type: Class

Band
label: banda @pt
label: Musikgruppe @de
type: Class
label: groupe de musique @fr

has Boxer
domain: philosopher
comment: Relation between Philosopher and Boxer
comment: Relazione tra Philosopher e Boxer @it
type: ObjectProperty
range: boxer

has Television Episode
comment: Relation between Philosopher and Television Episode
comment: Relazione tra Philosopher e Television Episode @it
range: television episode
type: ObjectProperty
domain: philosopher

has Comics Creator
range: comics creator
domain: philosopher
comment: Relazione tra Philosopher e Comics Creator @it
comment: Relation between Philosopher and Comics Creator
type: ObjectProperty

embryology
label: embryologie @fr
type: Class

has Music Genre
comment: Relazione tra Philosopher e Music Genre @it
range: music genre
type: ObjectProperty
comment: Relation between Philosopher and Music Genre
domain: philosopher

music festival
type: Class
label: festival de musique @fr

television episode
label: épisode télévisé @fr
type: Class

Axiom
annotated target: influences
annotated source: has Saint
matching quantification: 1

village
type: Class
label: χωριό @el

has British Royalty
range: British royalty
comment: Relation between Philosopher and British Royalty
comment: Relazione tra Philosopher e British Royalty @it
type: ObjectProperty
domain: philosopher

has Lake
domain: philosopher
range: lake
comment: Relation between Philosopher and Lake
comment: Relazione tra Philosopher e Lake @it
type: ObjectProperty

has Band
comment: Relation between Philosopher and Band
comment: Relazione tra Philosopher e Band @it
range: Band
domain: philosopher
type: ObjectProperty

has Gridiron Football Player
range: gridiron football player
comment: Relazione tra Philosopher e Gridiron Football Player @it
type: ObjectProperty
domain: philosopher
comment: Relation between Philosopher and Gridiron Football Player

historic building
type: Class
label: bâtiment historique @fr

has Lunar Crater
comment: Relation between Philosopher and Lunar Crater
comment: Relazione tra Philosopher e Lunar Crater @it
domain: philosopher
type: ObjectProperty
range: lunar crater

has Embryology
comment: Relazione tra Philosopher e Embryology @it
comment: Relation between Philosopher and Embryology
range: embryology
type: ObjectProperty
domain: philosopher

has Fish
comment: Relazione tra Philosopher e Fish @it
type: ObjectProperty
domain: philosopher
comment: Relation between Philosopher and Fish
range: fish

grape
type: Class
label: raisin @fr

website
type: Class
label: Ιστότοπος @el
label: site web @fr

Axiom
annotated source: has Musical Artist
matching quantification: 1
annotated target: students

has Cricketer
domain: philosopher
comment: Relation between Philosopher and Cricketer
type: ObjectProperty
range: cricketer
comment: Relazione tra Philosopher e Cricketer @it

has Architect
domain: philosopher
comment: Relazione tra Philosopher e Architect @it
range: architect
comment: Relation between Philosopher and Architect
type: ObjectProperty

has Non- Profit Organisation
comment: Relation between Philosopher and Non- Profit Organisation
comment: Relazione tra Philosopher e Non- Profit Organisation @it
type: ObjectProperty
range: non-profit organisation
domain: philosopher

mountain range
type: Class
label: chaîne de montagne @fr

has Fungus
comment: Relazione tra Philosopher e Fungus @it
type: ObjectProperty
range: fungus
domain: philosopher
comment: Relation between Philosopher and Fungus

Christian Bishop
type: Class
label: évêque chrétien @fr

has Bone
comment: Relazione tra Philosopher e Bone @it
comment: Relation between Philosopher and Bone
type: ObjectProperty
domain: philosopher
range: bone

has Magazine
domain: philosopher
comment: Relazione tra Philosopher e Magazine @it
type: ObjectProperty
range: magazine
comment: Relation between Philosopher and Magazine

planet
label: planète @fr
type: Class

Axiom
annotated target: before
matching quantification: 1
annotated source: has Prime Minister

has Airline
range: airline
domain: philosopher
comment: Relazione tra Philosopher e Airline @it
comment: Relation between Philosopher and Airline
type: ObjectProperty

has Skyscraper
type: ObjectProperty
range: skyscraper
domain: philosopher
comment: Relazione tra Philosopher e Skyscraper @it
comment: Relation between Philosopher and Skyscraper

bridge
label: pont @fr
type: Class

has Species
range: species
domain: philosopher
type: ObjectProperty
comment: Relation between Philosopher and Species
comment: Relazione tra Philosopher e Species @it

broadcast
type: Class
label: Émission de télévision @fr

has College
type: ObjectProperty
range: college
comment: Relation between Philosopher and College
domain: philosopher
comment: Relazione tra Philosopher e College @it
related match: title

has Shopping Mall
comment: Relazione tra Philosopher e Shopping Mall @it
range: shopping mall
domain: philosopher
type: ObjectProperty
comment: Relation between Philosopher and Shopping Mall

mammal
label: mammifère @fr
type: Class

island
label: île @fr
label: νησί @el
type: Class

has Drug
type: ObjectProperty
comment: Relation between Philosopher and Drug
range: drug
domain: philosopher
comment: Relazione tra Philosopher e Drug @it

comics character
type: Class
label: personnage de bandes dessinées @fr

has Bridge
comment: Relation between Philosopher and Bridge
range: bridge
comment: Relazione tra Philosopher e Bridge @it
type: ObjectProperty
domain: philosopher

has World Heritage Site
comment: Relation between Philosopher and World Heritage Site
type: ObjectProperty
range: World Heritage Site
domain: philosopher
comment: Relazione tra Philosopher e World Heritage Site @it

skyscraper
label: gratte-ciel @fr
type: Class

radio station
label: station de radio @fr
type: Class

member of parliament
type: Class
label: membre du Parlement @fr

bone
type: Class
label: Knochen @de
label: os @fr

has Space Station
comment: Relation between Philosopher and Space Station
domain: philosopher
comment: Relazione tra Philosopher e Space Station @it
range: space station
type: ObjectProperty

airport
label: aéroport @fr
label: Flughafen @de
type: Class