has Shopping Mall
range: shopping mall
type: ObjectProperty
domain: power station
comment: Relazione tra Power Station e Shopping Mall @it
comment: Relation between Power Station and Shopping Mall

has Comedian
range: comedian
comment: Relazione tra Power Station e Comedian @it
type: ObjectProperty
domain: power station
comment: Relation between Power Station and Comedian

has Airport
range: airport
domain: power station
comment: Relazione tra Power Station e Airport @it
type: ObjectProperty
comment: Relation between Power Station and Airport

television show
type: Class
label: émission de télévision @fr

park
type: Class
label: parc @fr

disease
label: maladie @fr
type: Class

has Architect
comment: Relation between Power Station and Architect
comment: Relazione tra Power Station e Architect @it
range: architect
domain: power station
type: ObjectProperty

rugby player
type: Class
label: joueur de rugby @fr

has Village
domain: power station
range: village
type: ObjectProperty
comment: Relazione tra Power Station e Village @it
comment: Relation between Power Station and Village

automobile
type: Class

has Canal
type: ObjectProperty
domain: power station
comment: Relazione tra Power Station e Canal @it
range: canal
comment: Relation between Power Station and Canal

has Station
type: ObjectProperty
comment: Relazione tra Power Station e Station @it
range: station
comment: Relation between Power Station and Station
domain: power station

has Journalist
domain: power station
type: ObjectProperty
comment: Relazione tra Power Station e Journalist @it
comment: Relation between Power Station and Journalist
range: journalist

Election
type: Class
label: élection @fr

has Newspaper
type: ObjectProperty
comment: Relazione tra Power Station e Newspaper @it
comment: Relation between Power Station and Newspaper
domain: power station
range: newspaper

has Town
range: town
domain: power station
type: ObjectProperty
comment: Relation between Power Station and Town
comment: Relazione tra Power Station e Town @it
related match: location

has Park
domain: power station
range: park
type: ObjectProperty
comment: Relazione tra Power Station e Park @it
comment: Relation between Power Station and Park

actor
label: Schauspieler @de
type: Class
label: acteur @fr

stadium
type: Class
label: stade @fr

has Song
type: ObjectProperty
range: song
domain: power station
comment: Relation between Power Station and Song
comment: Relazione tra Power Station e Song @it

mountain
type: Class
label: montagne @fr
label: Βουνό @el

has Television Episode
range: television episode
comment: Relazione tra Power Station e Television Episode @it
type: ObjectProperty
comment: Relation between Power Station and Television Episode
domain: power station

flowering plant
label: angiospermes @fr
type: Class

has Locomotive
comment: Relazione tra Power Station e Locomotive @it
comment: Relation between Power Station and Locomotive
domain: power station
range: locomotive
type: ObjectProperty

has Book
comment: Relazione tra Power Station e Book @it
range: book
type: ObjectProperty
comment: Relation between Power Station and Book
domain: power station

senator
label: sénateur @fr
type: Class

has Supreme Court Of The United States Case
comment: Relation between Power Station and Supreme Court Of The United States Case
domain: power station
type: ObjectProperty
comment: Relazione tra Power Station e Supreme Court Of The United States Case @it
range: Supreme Court of the United States case

comedian
type: Class
label: comédien @fr

has Member Of Parliament
type: ObjectProperty
comment: Relation between Power Station and Member Of Parliament
range: member of parliament
domain: power station
comment: Relazione tra Power Station e Member Of Parliament @it

has Language
type: ObjectProperty
range: language
domain: power station
comment: Relation between Power Station and Language
comment: Relazione tra Power Station e Language @it

song
label: chanson @fr
type: Class

has Military Unit
range: military unit
domain: power station
comment: Relation between Power Station and Military Unit
type: ObjectProperty
comment: Relazione tra Power Station e Military Unit @it

newspaper
type: Class
label: journal @fr

has Disease
comment: Relazione tra Power Station e Disease @it
comment: Relation between Power Station and Disease
domain: power station
range: disease
type: ObjectProperty

protected area
label: aire protégée @fr
label: προστατευμένη περιοχή @el
type: Class

has Military Conflict
domain: power station
comment: Relation between Power Station and Military Conflict
comment: Relazione tra Power Station e Military Conflict @it
range: military conflict
type: ObjectProperty

road
label: route @fr
type: Class

has Lake
comment: Relazione tra Power Station e Lake @it
type: ObjectProperty
comment: Relation between Power Station and Lake
domain: power station
range: lake

book
label: książka @pl
label: llibre @ca
label: βιβλίο @el
label: livre @fr
type: Class

has Office Holder
comment: Relation between Power Station and Office Holder
range: office holder
type: ObjectProperty
domain: power station
comment: Relazione tra Power Station e Office Holder @it

has Mollusca
domain: power station
range: mollusca
comment: Relation between Power Station and Mollusca
type: ObjectProperty
comment: Relazione tra Power Station e Mollusca @it

has Scientist
comment: Relazione tra Power Station e Scientist @it
range: scientist
comment: Relation between Power Station and Scientist
domain: power station
type: ObjectProperty

World Heritage Site
label: site du patrimoine mondial @fr
type: Class

shopping mall
label: centre commercial @fr
type: Class

language
type: Class
label: langage @fr

station
type: Class

has Album
type: ObjectProperty
range: album
comment: Relation between Power Station and Album
domain: power station
comment: Relazione tra Power Station e Album @it

has Radio Station
comment: Relazione tra Power Station e Radio Station @it
range: radio station
domain: power station
type: ObjectProperty
comment: Relation between Power Station and Radio Station

non-profit organisation
type: Class
label: organisation à but non lucratif @fr

lake
type: Class
label: lac @fr

mollusca
type: Class
label: mollusque @fr

has Lighthouse
comment: Relation between Power Station and Lighthouse
comment: Relazione tra Power Station e Lighthouse @it
domain: power station
range: lighthouse
type: ObjectProperty

has Automobile
range: automobile
comment: Relazione tra Power Station e Automobile @it
type: ObjectProperty
comment: Relation between Power Station and Automobile
domain: power station

has Fish
range: fish
type: ObjectProperty
comment: Relation between Power Station and Fish
comment: Relazione tra Power Station e Fish @it
domain: power station

Axiom
matching quantification: 2
annotated source: has Town
annotated target: location

magazine
type: Class
label: περιοδικό @el

fish
label: poisson @fr
type: Class

museum
type: Class
label: musée @fr

ship
label: navire @fr
type: Class

has Historic Place
domain: power station
type: ObjectProperty
range: historic place
comment: Relation between Power Station and Historic Place
comment: Relazione tra Power Station e Historic Place @it

trade union
label: syndicat professionnel @fr
type: Class

canal
type: Class

military person
label: militaire @fr
type: Class

currency
type: Class
label: devise @fr

British royalty
type: Class
label: royauté Britannique @fr

prime minister
type: Class
label: premier ministre @fr

historic place
type: Class
label: site historique @fr

locomotive
type: Class

sport
type: Class

has Olympics
range: olympics
comment: Relazione tra Power Station e Olympics @it
type: ObjectProperty
comment: Relation between Power Station and Olympics
domain: power station

has President
comment: Relation between Power Station and President
comment: Relazione tra Power Station e President @it
type: ObjectProperty
domain: power station
range: president

Band
label: banda @pt
label: Musikgruppe @de
type: Class
label: groupe de musique @fr

town
label: ville @fr
type: Class

has Prime Minister
range: prime minister
comment: Relation between Power Station and Prime Minister
comment: Relazione tra Power Station e Prime Minister @it
domain: power station
type: ObjectProperty

university
type: Class
label: université @fr
label: πανεπιστήμιο @el

has Election
comment: Relazione tra Power Station e Election @it
range: Election
type: ObjectProperty
comment: Relation between Power Station and Election
domain: power station

Axiom
annotated target: fuelType
matching quantification: 1
annotated source: has Chemical Compound

continent
label: ήπειρος @el
type: Class

ethnic group
label: groupe ethnique @fr
type: Class

president
label: président @fr
type: Class

album
label: Album @de
type: Class

has Comics Character
domain: power station
range: comics character
comment: Relazione tra Power Station e Comics Character @it
comment: Relation between Power Station and Comics Character
type: ObjectProperty

military unit
label: unité militaire @fr
type: Class

has Island
comment: Relation between Power Station and Island
type: ObjectProperty
range: island
comment: Relazione tra Power Station e Island @it
domain: power station

has Ethnic Group
comment: Relation between Power Station and Ethnic Group
domain: power station
comment: Relazione tra Power Station e Ethnic Group @it
range: ethnic group
type: ObjectProperty

television episode
label: épisode télévisé @fr
type: Class

has Stadium
comment: Relation between Power Station and Stadium
type: ObjectProperty
range: stadium
domain: power station
comment: Relazione tra Power Station e Stadium @it

has Sport
domain: power station
type: ObjectProperty
range: sport
comment: Relazione tra Power Station e Sport @it
comment: Relation between Power Station and Sport

village
label: χωριό @el
type: Class

has Senator
comment: Relazione tra Power Station e Senator @it
range: senator
type: ObjectProperty
comment: Relation between Power Station and Senator
domain: power station

has University
type: ObjectProperty
range: university
domain: power station
comment: Relazione tra Power Station e University @it
comment: Relation between Power Station and University

has Broadcast
domain: power station
type: ObjectProperty
comment: Relazione tra Power Station e Broadcast @it
comment: Relation between Power Station and Broadcast
range: broadcast

has Rugby Player
comment: Relation between Power Station and Rugby Player
type: ObjectProperty
domain: power station
range: rugby player
comment: Relazione tra Power Station e Rugby Player @it

has Mountain
related match: location
comment: Relation between Power Station and Mountain
type: ObjectProperty
range: mountain
comment: Relazione tra Power Station e Mountain @it
domain: power station

writer
label: écrivain @fr
type: Class

Axiom
annotated source: has Mountain
matching quantification: 1
annotated target: location

has Film
domain: power station
range: film
comment: Relation between Power Station and Film
comment: Relazione tra Power Station e Film @it
type: ObjectProperty

has Military Person
type: ObjectProperty
comment: Relazione tra Power Station e Military Person @it
range: military person
domain: power station
comment: Relation between Power Station and Military Person

office holder
label: titulaire @fr
type: Class
label: Amtsinhaber @de

military conflict
label: conflit militaire @fr
type: Class

architect
label: architecte @fr
type: Class

has Museum
range: museum
comment: Relation between Power Station and Museum
domain: power station
type: ObjectProperty
comment: Relazione tra Power Station e Museum @it

has Currency
range: currency
type: ObjectProperty
domain: power station
comment: Relazione tra Power Station e Currency @it
comment: Relation between Power Station and Currency

has Continent
comment: Relation between Power Station and Continent
range: continent
comment: Relazione tra Power Station e Continent @it
type: ObjectProperty
domain: power station

has Magazine
comment: Relation between Power Station and Magazine
type: ObjectProperty
domain: power station
range: magazine
comment: Relazione tra Power Station e Magazine @it

has Aircraft
comment: Relazione tra Power Station e Aircraft @it
domain: power station
type: ObjectProperty
comment: Relation between Power Station and Aircraft
range: aircraft

has Bird
range: bird
type: ObjectProperty
domain: power station
comment: Relazione tra Power Station e Bird @it
comment: Relation between Power Station and Bird

has Protected Area
type: ObjectProperty
comment: Relation between Power Station and Protected Area
comment: Relazione tra Power Station e Protected Area @it
domain: power station
range: protected area

mountain range
label: chaîne de montagne @fr
type: Class

has Conifer
comment: Relation between Power Station and Conifer
range: conifer
comment: Relazione tra Power Station e Conifer @it
type: ObjectProperty
domain: power station

has Flowering Plant
comment: Relation between Power Station and Flowering Plant
type: ObjectProperty
comment: Relazione tra Power Station e Flowering Plant @it
range: flowering plant
domain: power station

has Actor
domain: power station
range: actor
type: ObjectProperty
comment: Relation between Power Station and Actor
comment: Relazione tra Power Station e Actor @it

lighthouse
label: phare @fr
type: Class

has Road
domain: power station
type: ObjectProperty
comment: Relazione tra Power Station e Road @it
comment: Relation between Power Station and Road
range: road

aircraft
label: αεροσκάφος @el
type: Class
label: avion @fr

has Chemical Compound
related match: fuelType
comment: Relation between Power Station and Chemical Compound
domain: power station
type: ObjectProperty
range: chemical compound
comment: Relazione tra Power Station e Chemical Compound @it

has Skyscraper
comment: Relation between Power Station and Skyscraper
type: ObjectProperty
comment: Relazione tra Power Station e Skyscraper @it
domain: power station
range: skyscraper

scientist
label: scientifique @fr
type: Class
label: Wissenschaftler @de

legislature
label: pouvoir législatif @fr
type: Class

has Writer
comment: Relation between Power Station and Writer
type: ObjectProperty
comment: Relazione tra Power Station e Writer @it
range: writer
domain: power station

airline
label: compagnie aérienne @fr
type: Class

olympics
type: Class
label: Jeux Olympiques @fr

has Television Show
domain: power station
comment: Relazione tra Power Station e Television Show @it
type: ObjectProperty
range: television show
comment: Relation between Power Station and Television Show

has Legislature
range: legislature
type: ObjectProperty
domain: power station
comment: Relazione tra Power Station e Legislature @it
comment: Relation between Power Station and Legislature

Ontology
extracted from: dbpedia.org
has author: Andrea Giovanni Nuzzolese
comment: PowerStation Encyclopedic Knowledge Pattern
has intent: To represent the encyclopedic knowledge expressed by an object typed as PowerStation
extracted from: en.wikipedia.org
has author: Aldo Gangemi
has author: Valentina Presutti
imports: cpannotationschema.owl

bridge
label: pont @fr
type: Class

has Ship
comment: Relation between Power Station and Ship
comment: Relazione tra Power Station e Ship @it
domain: power station
range: ship
type: ObjectProperty

journalist
label: journaliste @fr
type: Class

broadcast
label: Émission de télévision @fr
type: Class

has Airline
type: ObjectProperty
comment: Relazione tra Power Station e Airline @it
range: airline
comment: Relation between Power Station and Airline
domain: power station

film
label: ταινία @el
type: Class

mammal
type: Class
label: mammifère @fr

has Mountain Range
range: mountain range
comment: Relation between Power Station and Mountain Range
type: ObjectProperty
comment: Relazione tra Power Station e Mountain Range @it
domain: power station

has World Heritage Site
domain: power station
range: World Heritage Site
type: ObjectProperty
comment: Relazione tra Power Station e World Heritage Site @it
comment: Relation between Power Station and World Heritage Site

island
label: île @fr
label: νησί @el
type: Class

Supreme Court of the United States case
type: Class
label: cas juridique de la Cour suprême des États-Unis @fr

comics character
type: Class
label: personnage de bandes dessinées @fr

bird
label: oiseau @fr
type: Class

chemical compound
type: Class
label: produit chimique @fr

skyscraper
type: Class
label: gratte-ciel @fr

has Bridge
range: bridge
type: ObjectProperty
domain: power station
comment: Relazione tra Power Station e Bridge @it
comment: Relation between Power Station and Bridge

power station
type: Class

has British Royalty
range: British royalty
domain: power station
type: ObjectProperty
comment: Relation between Power Station and British Royalty
comment: Relazione tra Power Station e British Royalty @it

radio station
type: Class
label: station de radio @fr

has Trade Union
comment: Relazione tra Power Station e Trade Union @it
comment: Relation between Power Station and Trade Union
type: ObjectProperty
domain: power station
range: trade union

member of parliament
label: membre du Parlement @fr
type: Class

has Band
type: ObjectProperty
domain: power station
comment: Relation between Power Station and Band
range: Band
comment: Relazione tra Power Station e Band @it

airport
label: aéroport @fr
label: Flughafen @de
type: Class

has Non- Profit Organisation
domain: power station
comment: Relazione tra Power Station e Non- Profit Organisation @it
range: non-profit organisation
comment: Relation between Power Station and Non- Profit Organisation
type: ObjectProperty

has Mammal
comment: Relation between Power Station and Mammal
range: mammal
comment: Relazione tra Power Station e Mammal @it
type: ObjectProperty
domain: power station

conifer
type: Class
label: conifères @fr