has Mountain Range
domain: prime minister
comment: Relazione tra Prime Minister e Mountain Range @it
comment: Relation between Prime Minister and Mountain Range
type: ObjectProperty
range: mountain range

has Mammal
domain: prime minister
range: mammal
comment: Relazione tra Prime Minister e Mammal @it
comment: Relation between Prime Minister and Mammal
type: ObjectProperty

has Town
comment: Relazione tra Prime Minister e Town @it
type: ObjectProperty
related match: deathPlace
related match: birthPlace
comment: Relation between Prime Minister and Town
domain: prime minister
related match: placeOfBirth
range: town
related match: placeOfDeath

Axiom
annotated target: before
annotated source: has Governor
matching quantification: 2

has Journalist
comment: Relation between Prime Minister and Journalist
comment: Relazione tra Prime Minister e Journalist @it
range: journalist
type: ObjectProperty
domain: prime minister

television show
label: émission de télévision @fr
type: Class

has Ship
domain: prime minister
range: ship
comment: Relazione tra Prime Minister e Ship @it
comment: Relation between Prime Minister and Ship
type: ObjectProperty
related match: commands

has Video Game
comment: Relazione tra Prime Minister e Video Game @it
comment: Relation between Prime Minister and Video Game
domain: prime minister
type: ObjectProperty
range: video game

disease
label: maladie @fr
type: Class

has Bridge
type: ObjectProperty
domain: prime minister
comment: Relation between Prime Minister and Bridge
range: bridge
comment: Relazione tra Prime Minister e Bridge @it

Axiom
annotated target: before
annotated source: has Military Person
matching quantification: 2

colour
type: Class
label: couleur @fr
label: χρώμα @el

Axiom
annotated target: post3preceded
annotated source: has Governor
matching quantification: 1

has Monarch
related match: after
related match: before
related match: monarch
related match: president
comment: Relation between Prime Minister and Monarch
type: ObjectProperty
domain: prime minister
range: monarch
comment: Relazione tra Prime Minister e Monarch @it

has Rugby Player
range: rugby player
domain: prime minister
comment: Relazione tra Prime Minister e Rugby Player @it
type: ObjectProperty
comment: Relation between Prime Minister and Rugby Player

has Musical
type: ObjectProperty
comment: Relazione tra Prime Minister e Musical @it
domain: prime minister
range: musical
comment: Relation between Prime Minister and Musical

has Album
type: ObjectProperty
range: album
comment: Relazione tra Prime Minister e Album @it
comment: Relation between Prime Minister and Album
domain: prime minister

has Ambassador
comment: Relation between Prime Minister and Ambassador
comment: Relazione tra Prime Minister e Ambassador @it
domain: prime minister
range: ambassador
type: ObjectProperty

Axiom
annotated target: years
matching quantification: 1
annotated source: has Writer

stadium
type: Class
label: stade @fr

has Hotel
comment: Relazione tra Prime Minister e Hotel @it
type: ObjectProperty
domain: prime minister
range: hotel
comment: Relation between Prime Minister and Hotel

Axiom
matching quantification: 1
annotated source: has Military Person
annotated target: regent

soccer league
label: ligue de football @fr
type: Class

Axiom
matching quantification: 29
annotated target: after
annotated source: has Member Of Parliament

Axiom
annotated source: has Chancellor
annotated target: before
matching quantification: 1

mayor
label: maire @fr
type: Class

pope
type: Class
label: pape @fr

has Protected Area
domain: prime minister
comment: Relation between Prime Minister and Protected Area
comment: Relazione tra Prime Minister e Protected Area @it
type: ObjectProperty
range: protected area

Axiom
annotated target: residence
matching quantification: 1
annotated source: has Village

newspaper
label: journal @fr
type: Class

game
label: jeu @fr
type: Class

protected area
label: aire protégée @fr
label: προστατευμένη περιοχή @el
type: Class

road
label: route @fr
type: Class

Axiom
matching quantification: 1
annotated source: has Town
annotated target: placeOfDeath

judge
label: juge @fr
type: Class

has School
related match: almaMater
type: ObjectProperty
range: school
comment: Relazione tra Prime Minister e School @it
domain: prime minister
comment: Relation between Prime Minister and School

World Heritage Site
type: Class
label: site du patrimoine mondial @fr

Axiom
annotated source: has Mayor
annotated target: after
matching quantification: 2

has Colour
range: colour
type: ObjectProperty
comment: Relazione tra Prime Minister e Colour @it
domain: prime minister
comment: Relation between Prime Minister and Colour

station
type: Class

language
label: langage @fr
type: Class

tennis league
label: ligue de tennis @fr
type: Class

has Sport
range: sport
comment: Relation between Prime Minister and Sport
type: ObjectProperty
comment: Relazione tra Prime Minister e Sport @it
domain: prime minister

lake
label: lac @fr
type: Class

has Lighthouse
comment: Relazione tra Prime Minister e Lighthouse @it
comment: Relation between Prime Minister and Lighthouse
domain: prime minister
range: lighthouse
type: ObjectProperty

has Chemical Compound
comment: Relazione tra Prime Minister e Chemical Compound @it
domain: prime minister
range: chemical compound
type: ObjectProperty
comment: Relation between Prime Minister and Chemical Compound

has Soccer Club
range: soccer club
type: ObjectProperty
comment: Relazione tra Prime Minister e Soccer Club @it
domain: prime minister
comment: Relation between Prime Minister and Soccer Club

governor
label: gouverneur @fr
type: Class

Axiom
annotated source: has Member Of Parliament
matching quantification: 1
annotated target: post1followed

river
label: rivière @fr
type: Class

has Park
domain: prime minister
comment: Relazione tra Prime Minister e Park @it
range: park
type: ObjectProperty
comment: Relation between Prime Minister and Park

school
label: école @fr
type: Class

ship
type: Class
label: navire @fr

museum
label: musée @fr
type: Class

fish
type: Class
label: poisson @fr

Axiom
annotated source: has Language
annotated target: languagesspoken
matching quantification: 2

has Ski Area
range: ski area
comment: Relazione tra Prime Minister e Ski Area @it
comment: Relation between Prime Minister and Ski Area
type: ObjectProperty
domain: prime minister

has World Heritage Site
domain: prime minister
comment: Relation between Prime Minister and World Heritage Site
range: World Heritage Site
type: ObjectProperty
comment: Relazione tra Prime Minister e World Heritage Site @it

video game
type: Class
label: jeux vidéo @fr

has Historic Building
comment: Relazione tra Prime Minister e Historic Building @it
comment: Relation between Prime Minister and Historic Building
range: historic building
type: ObjectProperty
domain: prime minister

trade union
type: Class
label: syndicat professionnel @fr

has Village
comment: Relation between Prime Minister and Village
type: ObjectProperty
comment: Relazione tra Prime Minister e Village @it
domain: prime minister
range: village
related match: residence

currency
label: devise @fr
type: Class

prime minister
label: premier ministre @fr
type: Class

Axiom
annotated source: has Member Of Parliament
annotated target: post2followed
matching quantification: 1

has College
type: ObjectProperty
domain: prime minister
range: college
comment: Relazione tra Prime Minister e College @it
comment: Relation between Prime Minister and College

historic place
type: Class
label: site historique @fr

has Island
comment: Relazione tra Prime Minister e Island @it
type: ObjectProperty
domain: prime minister
comment: Relation between Prime Minister and Island
range: island

hospital
type: Class
label: hôpital @fr

has Road
domain: prime minister
range: road
comment: Relation between Prime Minister and Road
comment: Relazione tra Prime Minister e Road @it
type: ObjectProperty

has Game
comment: Relation between Prime Minister and Game
comment: Relazione tra Prime Minister e Game @it
type: ObjectProperty
domain: prime minister
range: game

Axiom
annotated target: after
matching quantification: 1
annotated source: has Monarch

lunar crater
type: Class
label: cratère lunaire @fr

Axiom
matching quantification: 1
annotated source: has Monarch
annotated target: before

has Gaelic Games Player
comment: Relation between Prime Minister and Gaelic Games Player
comment: Relazione tra Prime Minister e Gaelic Games Player @it
domain: prime minister
range: Gaelic games player
type: ObjectProperty

has Mountain
comment: Relation between Prime Minister and Mountain
comment: Relazione tra Prime Minister e Mountain @it
type: ObjectProperty
range: mountain
domain: prime minister

has Single
comment: Relation between Prime Minister and Single
range: single
type: ObjectProperty
comment: Relazione tra Prime Minister e Single @it
domain: prime minister

continent
label: ήπειρος @el
type: Class

has Television Episode
comment: Relation between Prime Minister and Television Episode
type: ObjectProperty
comment: Relazione tra Prime Minister e Television Episode @it
range: television episode
domain: prime minister

has Ice Hockey League
domain: prime minister
range: ice hockey league
comment: Relazione tra Prime Minister e Ice Hockey League @it
comment: Relation between Prime Minister and Ice Hockey League
type: ObjectProperty

album
type: Class
label: Album @de

Axiom
annotated source: has Town
matching quantification: 1
annotated target: birthPlace

figure skater
type: Class
label: patineur artistique @fr

has Flowering Plant
range: flowering plant
comment: Relation between Prime Minister and Flowering Plant
comment: Relazione tra Prime Minister e Flowering Plant @it
domain: prime minister
type: ObjectProperty

has Book
comment: Relation between Prime Minister and Book
type: ObjectProperty
comment: Relazione tra Prime Minister e Book @it
range: book
domain: prime minister

military unit
type: Class
label: unité militaire @fr

Axiom
annotated target: post4preceded
matching quantification: 1
annotated source: has Member Of Parliament

has Planet
comment: Relazione tra Prime Minister e Planet @it
type: ObjectProperty
domain: prime minister
range: planet
comment: Relation between Prime Minister and Planet

has Gridiron Football Player
comment: Relazione tra Prime Minister e Gridiron Football Player @it
type: ObjectProperty
range: gridiron football player
domain: prime minister
comment: Relation between Prime Minister and Gridiron Football Player

soccer manager
label: entraîneur de football @fr
type: Class

has Lake
domain: prime minister
type: ObjectProperty
range: lake
comment: Relation between Prime Minister and Lake
comment: Relazione tra Prime Minister e Lake @it

has Language
related match: languagesspoken
range: language
comment: Relation between Prime Minister and Language
domain: prime minister
comment: Relazione tra Prime Minister e Language @it
type: ObjectProperty

music genre
type: Class
label: género musical @pt
label: genre musical @fr

writer
type: Class
label: écrivain @fr

has Fictional Character
domain: prime minister
comment: Relazione tra Prime Minister e Fictional Character @it
range: fictional character
type: ObjectProperty
comment: Relation between Prime Minister and Fictional Character

has Senator
range: senator
domain: prime minister
type: ObjectProperty
comment: Relation between Prime Minister and Senator
comment: Relazione tra Prime Minister e Senator @it

record label
label: label discographique @fr
type: Class

has Soccer Manager
type: ObjectProperty
range: soccer manager
domain: prime minister
comment: Relazione tra Prime Minister e Soccer Manager @it
comment: Relation between Prime Minister and Soccer Manager

architect
type: Class
label: architecte @fr

Axiom
annotated target: governorGeneral
matching quantification: 8
annotated source: has Governor

ambassador
type: Class
label: ambassadeur @fr

has Magazine
range: magazine
domain: prime minister
comment: Relation between Prime Minister and Magazine
type: ObjectProperty
comment: Relazione tra Prime Minister e Magazine @it

Axiom
annotated target: after
annotated source: has Military Person
matching quantification: 5

has Shopping Mall
comment: Relazione tra Prime Minister e Shopping Mall @it
type: ObjectProperty
comment: Relation between Prime Minister and Shopping Mall
range: shopping mall
domain: prime minister

Axiom
matching quantification: 1
annotated source: has Military Person
annotated target: governor

lighthouse
type: Class
label: phare @fr

Axiom
matching quantification: 6
annotated source: has School
annotated target: almaMater

chancellor
type: Class
label: chancelier @fr

Axiom
annotated source: has Town
matching quantification: 1
annotated target: deathPlace

aircraft
label: avion @fr
type: Class
label: αεροσκάφος @el

has Lunar Crater
range: lunar crater
type: ObjectProperty
comment: Relation between Prime Minister and Lunar Crater
domain: prime minister
comment: Relazione tra Prime Minister e Lunar Crater @it

has Radio Station
comment: Relation between Prime Minister and Radio Station
range: radio station
domain: prime minister
comment: Relazione tra Prime Minister e Radio Station @it
type: ObjectProperty

soccer player
label: joueur de football @fr
type: Class

has River
type: ObjectProperty
range: river
comment: Relazione tra Prime Minister e River @it
domain: prime minister
comment: Relation between Prime Minister and River

has Soccer Player
domain: prime minister
comment: Relation between Prime Minister and Soccer Player
comment: Relazione tra Prime Minister e Soccer Player @it
type: ObjectProperty
range: soccer player

has Governor
related match: governorGeneral
related match: before
related match: post3preceded
type: ObjectProperty
comment: Relation between Prime Minister and Governor
comment: Relazione tra Prime Minister e Governor @it
domain: prime minister
range: governor

has Non- Profit Organisation
type: ObjectProperty
range: non-profit organisation
comment: Relazione tra Prime Minister e Non- Profit Organisation @it
comment: Relation between Prime Minister and Non- Profit Organisation
domain: prime minister

airline
label: compagnie aérienne @fr
type: Class

Axiom
matching quantification: 1
annotated target: unit
annotated source: has Military Unit

Axiom
matching quantification: 1
annotated source: has Philosopher
annotated target: before

Axiom
matching quantification: 16
annotated target: before
annotated source: has Member Of Parliament

monarch
label: monarque @fr
type: Class

has Member Of Parliament
related match: before
comment: Relation between Prime Minister and Member Of Parliament
type: ObjectProperty
related match: children
domain: prime minister
related match: post4preceded
range: member of parliament
related match: alongside
comment: Relazione tra Prime Minister e Member Of Parliament @it
related match: after
related match: post2followed
related match: post1followed

congressman
label: membre du Congrès @fr
type: Class

journalist
label: journaliste @fr
type: Class

Axiom
matching quantification: 1
annotated target: after
annotated source: has Criminal

has Award
comment: Relation between Prime Minister and Award
range: award
type: ObjectProperty
domain: prime minister
comment: Relazione tra Prime Minister e Award @it

film
type: Class
label: ταινία @el

has Philosopher
related match: before
comment: Relation between Prime Minister and Philosopher
domain: prime minister
range: philosopher
comment: Relazione tra Prime Minister e Philosopher @it
type: ObjectProperty

bird
type: Class
label: oiseau @fr

chemical compound
label: produit chimique @fr
type: Class

has Judge
domain: prime minister
comment: Relazione tra Prime Minister e Judge @it
comment: Relation between Prime Minister and Judge
type: ObjectProperty
range: judge
related match: post4followed

power station
type: Class

has Writer
comment: Relazione tra Prime Minister e Writer @it
domain: prime minister
comment: Relation between Prime Minister and Writer
range: writer
type: ObjectProperty
related match: before
related match: years

Gaelic games player
type: Class
label: joueur de sports gaéliques @fr

Axiom
annotated source: has Cricketer
annotated target: after
matching quantification: 2

Axiom
annotated target: president
matching quantification: 1
annotated source: has Monarch

has Saint
domain: prime minister
range: saint
type: ObjectProperty
comment: Relazione tra Prime Minister e Saint @it
comment: Relation between Prime Minister and Saint

has Canal
comment: Relazione tra Prime Minister e Canal @it
comment: Relation between Prime Minister and Canal
type: ObjectProperty
domain: prime minister
range: canal

musical artist
label: musicien @fr
type: Class
label: artista musical @pt

has Pope
comment: Relation between Prime Minister and Pope
type: ObjectProperty
comment: Relazione tra Prime Minister e Pope @it
domain: prime minister
range: pope

has Musical Artist
range: musical artist
comment: Relation between Prime Minister and Musical Artist
domain: prime minister
comment: Relazione tra Prime Minister e Musical Artist @it
type: ObjectProperty

fictional character
label: personnage de fiction @fr
type: Class

park
label: parc @fr
type: Class

has Mayor
comment: Relazione tra Prime Minister e Mayor @it
range: mayor
domain: prime minister
comment: Relation between Prime Minister and Mayor
type: ObjectProperty
related match: before
related match: after

cardinal
type: Class

rugby player
type: Class
label: joueur de rugby @fr

musical
label: musique @fr
type: Class

has Tennis League
domain: prime minister
range: tennis league
type: ObjectProperty
comment: Relazione tra Prime Minister e Tennis League @it
comment: Relation between Prime Minister and Tennis League

actor
label: Schauspieler @de
type: Class
label: acteur @fr

has Hospital
comment: Relation between Prime Minister and Hospital
range: hospital
domain: prime minister
type: ObjectProperty
comment: Relazione tra Prime Minister e Hospital @it

has Disease
range: disease
type: ObjectProperty
domain: prime minister
comment: Relation between Prime Minister and Disease
comment: Relazione tra Prime Minister e Disease @it

cyclist
type: Class
label: cycliste @fr

has Cricketer
domain: prime minister
type: ObjectProperty
comment: Relazione tra Prime Minister e Cricketer @it
comment: Relation between Prime Minister and Cricketer
range: cricketer
related match: after

has Continent
type: ObjectProperty
comment: Relation between Prime Minister and Continent
range: continent
comment: Relazione tra Prime Minister e Continent @it
domain: prime minister

has Fish
domain: prime minister
range: fish
comment: Relazione tra Prime Minister e Fish @it
comment: Relation between Prime Minister and Fish
type: ObjectProperty

Axiom
annotated source: has Member Of Parliament
matching quantification: 2
annotated target: alongside

Axiom
matching quantification: 1
annotated source: has Town
annotated target: placeOfBirth

has Newspaper
comment: Relation between Prime Minister and Newspaper
type: ObjectProperty
domain: prime minister
range: newspaper
comment: Relazione tra Prime Minister e Newspaper @it

has Airport
range: airport
comment: Relazione tra Prime Minister e Airport @it
type: ObjectProperty
comment: Relation between Prime Minister and Airport
domain: prime minister

has Bird
comment: Relation between Prime Minister and Bird
type: ObjectProperty
range: bird
comment: Relazione tra Prime Minister e Bird @it
domain: prime minister

mountain
label: Βουνό @el
label: montagne @fr
type: Class

has Music Genre
domain: prime minister
range: music genre
comment: Relation between Prime Minister and Music Genre
comment: Relazione tra Prime Minister e Music Genre @it
type: ObjectProperty

criminal
type: Class
label: criminel @fr

flowering plant
type: Class
label: angiospermes @fr

senator
label: sénateur @fr
type: Class

saint
type: Class

comedian
label: comédien @fr
type: Class

song
type: Class
label: chanson @fr

has Website
comment: Relation between Prime Minister and Website
domain: prime minister
range: website
comment: Relazione tra Prime Minister e Website @it
type: ObjectProperty

has Congressman
domain: prime minister
type: ObjectProperty
comment: Relazione tra Prime Minister e Congressman @it
range: congressman
comment: Relation between Prime Minister and Congressman

Axiom
matching quantification: 2
annotated target: before
annotated source: has Writer

book
type: Class
label: livre @fr
label: βιβλίο @el
label: książka @pl
label: llibre @ca

shopping mall
type: Class
label: centre commercial @fr

gridiron football player
label: joueur de football américain gridiron @fr
type: Class

ski area
type: Class
label: domaine skiable @fr

non-profit organisation
label: organisation à but non lucratif @fr
type: Class

has Bone
comment: Relazione tra Prime Minister e Bone @it
comment: Relation between Prime Minister and Bone
type: ObjectProperty
domain: prime minister
range: bone

has Television Show
range: television show
domain: prime minister
comment: Relation between Prime Minister and Television Show
type: ObjectProperty
comment: Relazione tra Prime Minister e Television Show @it

has Drug
type: ObjectProperty
range: drug
domain: prime minister
comment: Relation between Prime Minister and Drug
comment: Relazione tra Prime Minister e Drug @it

has Military Person
domain: prime minister
comment: Relazione tra Prime Minister e Military Person @it
related match: before
related match: governor
comment: Relation between Prime Minister and Military Person
range: military person
type: ObjectProperty
related match: after
related match: regent

has Weapon
comment: Relation between Prime Minister and Weapon
type: ObjectProperty
comment: Relazione tra Prime Minister e Weapon @it
domain: prime minister
range: weapon

weapon
label: arme @fr
type: Class

has Band
comment: Relazione tra Prime Minister e Band @it
type: ObjectProperty
comment: Relation between Prime Minister and Band
range: Band
domain: prime minister

has Stadium
type: ObjectProperty
comment: Relation between Prime Minister and Stadium
range: stadium
domain: prime minister
comment: Relazione tra Prime Minister e Stadium @it

drug
label: médicament @fr
type: Class

Axiom
annotated source: has Judge
annotated target: post4followed
matching quantification: 1

has Conifer
domain: prime minister
comment: Relazione tra Prime Minister e Conifer @it
comment: Relation between Prime Minister and Conifer
range: conifer
type: ObjectProperty

magazine
label: περιοδικό @el
type: Class

has Currency
comment: Relation between Prime Minister and Currency
range: currency
domain: prime minister
comment: Relazione tra Prime Minister e Currency @it
type: ObjectProperty

canal
type: Class

has Film
domain: prime minister
comment: Relation between Prime Minister and Film
type: ObjectProperty
range: film
comment: Relazione tra Prime Minister e Film @it

military person
type: Class
label: militaire @fr

philosopher
type: Class
label: philosophe @fr

award
type: Class
label: récompense @fr

has Ice Hockey Player
comment: Relazione tra Prime Minister e Ice Hockey Player @it
type: ObjectProperty
range: ice hockey player
domain: prime minister
comment: Relation between Prime Minister and Ice Hockey Player

college
type: Class

sport
type: Class

cricketer
type: Class
label: joueur de cricket @fr

single
type: Class

has Cyclist
domain: prime minister
range: cyclist
comment: Relation between Prime Minister and Cyclist
type: ObjectProperty
comment: Relazione tra Prime Minister e Cyclist @it

Band
label: groupe de musique @fr
type: Class
label: Musikgruppe @de
label: banda @pt

Ontology
extracted from: dbpedia.org
imports: cpannotationschema.owl
has intent: To represent the encyclopedic knowledge expressed by an object typed as PrimeMinister
has author: Andrea Giovanni Nuzzolese
has author: Aldo Gangemi
has author: Valentina Presutti
extracted from: en.wikipedia.org
comment: PrimeMinister Encyclopedic Knowledge Pattern

town
type: Class
label: ville @fr

has Scientist
domain: prime minister
type: ObjectProperty
range: scientist
comment: Relazione tra Prime Minister e Scientist @it
comment: Relation between Prime Minister and Scientist
related match: after
related match: before

has Song
type: ObjectProperty
range: song
comment: Relation between Prime Minister and Song
comment: Relazione tra Prime Minister e Song @it
domain: prime minister

has Station
comment: Relation between Prime Minister and Station
range: station
domain: prime minister
type: ObjectProperty
comment: Relazione tra Prime Minister e Station @it

has Airline
type: ObjectProperty
range: airline
comment: Relation between Prime Minister and Airline
domain: prime minister
comment: Relazione tra Prime Minister e Airline @it

has Basketball Player
type: ObjectProperty
comment: Relazione tra Prime Minister e Basketball Player @it
comment: Relation between Prime Minister and Basketball Player
range: basketball player
domain: prime minister
related match: deputy

Axiom
annotated target: before
annotated source: has Scientist
matching quantification: 2

hotel
type: Class
label: hôtel @fr

has Architect
domain: prime minister
type: ObjectProperty
comment: Relazione tra Prime Minister e Architect @it
range: architect
comment: Relation between Prime Minister and Architect

television episode
type: Class
label: épisode télévisé @fr

Axiom
annotated source: has Mayor
annotated target: before
matching quantification: 2

village
label: χωριό @el
type: Class

ice hockey league
type: Class
label: ligue d'hockey sur glace @fr

soccer club
label: club de football @fr
type: Class

has Trade Union
domain: prime minister
range: trade union
type: ObjectProperty
comment: Relazione tra Prime Minister e Trade Union @it
comment: Relation between Prime Minister and Trade Union

has Actor
comment: Relazione tra Prime Minister e Actor @it
range: actor
comment: Relation between Prime Minister and Actor
type: ObjectProperty
domain: prime minister

historic building
type: Class
label: bâtiment historique @fr

Axiom
annotated target: commands
matching quantification: 1
annotated source: has Ship

has Museum
type: ObjectProperty
comment: Relazione tra Prime Minister e Museum @it
comment: Relation between Prime Minister and Museum
domain: prime minister
range: museum

baseball player
label: joueur de baseball @fr
type: Class

has Record Label
comment: Relation between Prime Minister and Record Label
comment: Relazione tra Prime Minister e Record Label @it
type: ObjectProperty
domain: prime minister
range: record label

website
label: Ιστότοπος @el
label: site web @fr
type: Class

has Criminal
comment: Relation between Prime Minister and Criminal
range: criminal
type: ObjectProperty
comment: Relazione tra Prime Minister e Criminal @it
domain: prime minister
related match: after

has Soccer League
range: soccer league
type: ObjectProperty
comment: Relazione tra Prime Minister e Soccer League @it
domain: prime minister
comment: Relation between Prime Minister and Soccer League

has Olympics
domain: prime minister
range: olympics
comment: Relazione tra Prime Minister e Olympics @it
comment: Relation between Prime Minister and Olympics
type: ObjectProperty

basketball player
type: Class
label: joueur de basketball @fr

has Christian Bishop
comment: Relation between Prime Minister and Christian Bishop
domain: prime minister
comment: Relazione tra Prime Minister e Christian Bishop @it
type: ObjectProperty
range: Christian Bishop

ice hockey player
type: Class
label: joueur de hockey sur glace @fr

mountain range
label: chaîne de montagne @fr
type: Class

Christian Bishop
label: évêque chrétien @fr
type: Class

has Aircraft
type: ObjectProperty
comment: Relazione tra Prime Minister e Aircraft @it
comment: Relation between Prime Minister and Aircraft
range: aircraft
domain: prime minister

beverage
label: boisson @fr
type: Class

has Historic Place
range: historic place
comment: Relation between Prime Minister and Historic Place
comment: Relazione tra Prime Minister e Historic Place @it
type: ObjectProperty
domain: prime minister

has Cardinal
range: cardinal
type: ObjectProperty
comment: Relazione tra Prime Minister e Cardinal @it
domain: prime minister
comment: Relation between Prime Minister and Cardinal

planet
label: planète @fr
type: Class

has Comedian
domain: prime minister
comment: Relation between Prime Minister and Comedian
range: comedian
comment: Relazione tra Prime Minister e Comedian @it
type: ObjectProperty

has Skyscraper
domain: prime minister
comment: Relazione tra Prime Minister e Skyscraper @it
type: ObjectProperty
comment: Relation between Prime Minister and Skyscraper
range: skyscraper

has Baseball League
comment: Relation between Prime Minister and Baseball League
domain: prime minister
comment: Relazione tra Prime Minister e Baseball League @it
range: baseball league
type: ObjectProperty

Axiom
annotated target: after
annotated source: has Scientist
matching quantification: 1

scientist
label: Wissenschaftler @de
type: Class
label: scientifique @fr

has Beverage
comment: Relation between Prime Minister and Beverage
comment: Relazione tra Prime Minister e Beverage @it
domain: prime minister
type: ObjectProperty
range: beverage

olympics
type: Class
label: Jeux Olympiques @fr

has Military Unit
comment: Relation between Prime Minister and Military Unit
type: ObjectProperty
range: military unit
comment: Relazione tra Prime Minister e Military Unit @it
domain: prime minister
related match: unit

baseball league
type: Class
label: ligue de baseball @fr

has Broadcast
domain: prime minister
comment: Relation between Prime Minister and Broadcast
comment: Relazione tra Prime Minister e Broadcast @it
range: broadcast
type: ObjectProperty

Axiom
matching quantification: 1
annotated source: has Member Of Parliament
annotated target: children

bridge
type: Class
label: pont @fr

broadcast
type: Class
label: Émission de télévision @fr

has Chancellor
type: ObjectProperty
comment: Relation between Prime Minister and Chancellor
domain: prime minister
comment: Relazione tra Prime Minister e Chancellor @it
range: chancellor
related match: before

mammal
label: mammifère @fr
type: Class

island
type: Class
label: νησί @el
label: île @fr

Axiom
annotated source: has Monarch
annotated target: monarch
matching quantification: 1

has Baseball Player
domain: prime minister
range: baseball player
comment: Relazione tra Prime Minister e Baseball Player @it
type: ObjectProperty
comment: Relation between Prime Minister and Baseball Player

has Figure Skater
range: figure skater
domain: prime minister
comment: Relation between Prime Minister and Figure Skater
comment: Relazione tra Prime Minister e Figure Skater @it
type: ObjectProperty

skyscraper
type: Class
label: gratte-ciel @fr

Axiom
matching quantification: 1
annotated source: has Basketball Player
annotated target: deputy

has Power Station
comment: Relazione tra Prime Minister e Power Station @it
domain: prime minister
comment: Relation between Prime Minister and Power Station
range: power station
type: ObjectProperty

radio station
type: Class
label: station de radio @fr

bone
type: Class
label: Knochen @de
label: os @fr

member of parliament
label: membre du Parlement @fr
type: Class

conifer
label: conifères @fr
type: Class

airport
type: Class
label: Flughafen @de
label: aéroport @fr