has Pope
domain: protected area
range: pope
type: ObjectProperty
comment: Relation between Protected Area and Pope
comment: Relazione tra Protected Area e Pope @it

television show
label: émission de télévision @fr
type: Class

has Ethnic Group
type: ObjectProperty
comment: Relazione tra Protected Area e Ethnic Group @it
range: ethnic group
comment: Relation between Protected Area and Ethnic Group
domain: protected area

has Military Person
comment: Relation between Protected Area and Military Person
comment: Relazione tra Protected Area e Military Person @it
type: ObjectProperty
domain: protected area
range: military person

has Governor
range: governor
comment: Relazione tra Protected Area e Governor @it
type: ObjectProperty
comment: Relation between Protected Area and Governor
domain: protected area

has Astronaut
domain: protected area
comment: Relazione tra Protected Area e Astronaut @it
comment: Relation between Protected Area and Astronaut
range: astronaut
type: ObjectProperty

disease
label: maladie @fr
type: Class

colour
type: Class
label: couleur @fr
label: χρώμα @el

automobile
type: Class

american football player
type: Class
label: joueur de football américain @fr

stadium
type: Class
label: stade @fr

has Member Of Parliament
type: ObjectProperty
comment: Relazione tra Protected Area e Member Of Parliament @it
domain: protected area
comment: Relation between Protected Area and Member Of Parliament
range: member of parliament

soccer league
label: ligue de football @fr
type: Class

Axiom
matching quantification: 1
annotated source: has Park
annotated target: location

astronaut
label: astronaute @fr
label: Astronaut @de
type: Class

Site of Special Scientific Interest
label: site d'intérêt scientifique particulier @fr
type: Class

mayor
label: maire @fr
type: Class

amphibian
type: Class
label: amphibien @fr

pope
label: pape @fr
type: Class

has British Royalty
type: ObjectProperty
domain: protected area
comment: Relazione tra Protected Area e British Royalty @it
range: British royalty
comment: Relation between Protected Area and British Royalty

newspaper
type: Class
label: journal @fr

Axiom
annotated source: has Military Unit
annotated target: governingBody
matching quantification: 1

game
type: Class
label: jeu @fr

protected area
type: Class
label: aire protégée @fr
label: προστατευμένη περιοχή @el

road
label: route @fr
type: Class

ginkgo
type: Class

has Crustacean
comment: Relazione tra Protected Area e Crustacean @it
type: ObjectProperty
range: crustacean
comment: Relation between Protected Area and Crustacean
domain: protected area

boxer
type: Class
label: boxeur @fr

has Magazine
domain: protected area
comment: Relazione tra Protected Area e Magazine @it
type: ObjectProperty
comment: Relation between Protected Area and Magazine
range: magazine

judge
label: juge @fr
type: Class

has Amphibian
range: amphibian
type: ObjectProperty
comment: Relazione tra Protected Area e Amphibian @it
domain: protected area
comment: Relation between Protected Area and Amphibian

World Heritage Site
label: site du patrimoine mondial @fr
type: Class

station
type: Class

language
label: langage @fr
type: Class

has Mountain
domain: protected area
range: mountain
comment: Relation between Protected Area and Mountain
type: ObjectProperty
comment: Relazione tra Protected Area e Mountain @it
related match: highestLocation

has Insect
comment: Relation between Protected Area and Insect
range: insect
comment: Relazione tra Protected Area e Insect @it
domain: protected area
type: ObjectProperty
related match: animal

lake
label: lac @fr
type: Class

has Wine Region
type: ObjectProperty
domain: protected area
comment: Relazione tra Protected Area e Wine Region @it
range: wine region
comment: Relation between Protected Area and Wine Region

has Senator
domain: protected area
comment: Relation between Protected Area and Senator
comment: Relazione tra Protected Area e Senator @it
range: senator
type: ObjectProperty

arachnid
type: Class
label: arachnides @fr

has Cricketer
comment: Relazione tra Protected Area e Cricketer @it
comment: Relation between Protected Area and Cricketer
range: cricketer
type: ObjectProperty
domain: protected area

governor
label: gouverneur @fr
type: Class

has Museum
domain: protected area
comment: Relazione tra Protected Area e Museum @it
range: museum
comment: Relation between Protected Area and Museum
type: ObjectProperty

has Drug
domain: protected area
comment: Relation between Protected Area and Drug
comment: Relazione tra Protected Area e Drug @it
type: ObjectProperty
range: drug

has Congressman
range: congressman
domain: protected area
comment: Relation between Protected Area and Congressman
type: ObjectProperty
comment: Relazione tra Protected Area e Congressman @it

Axiom
annotated target: highestLocation
matching quantification: 1
annotated source: has Mountain

has Actor
comment: Relation between Protected Area and Actor
comment: Relazione tra Protected Area e Actor @it
range: actor
domain: protected area
type: ObjectProperty

school
label: école @fr
type: Class

ship
type: Class
label: navire @fr

fish
type: Class
label: poisson @fr

museum
label: musée @fr
type: Class

has Reptile
type: ObjectProperty
comment: Relation between Protected Area and Reptile
comment: Relazione tra Protected Area e Reptile @it
range: reptile
domain: protected area

video game
label: jeux vidéo @fr
type: Class

trade union
type: Class
label: syndicat professionnel @fr

has Judge
range: judge
comment: Relation between Protected Area and Judge
comment: Relazione tra Protected Area e Judge @it
type: ObjectProperty
domain: protected area

has Newspaper
domain: protected area
comment: Relation between Protected Area and Newspaper
comment: Relazione tra Protected Area e Newspaper @it
type: ObjectProperty
range: newspaper

currency
type: Class
label: devise @fr

has Race
type: ObjectProperty
domain: protected area
range: race
comment: Relazione tra Protected Area e Race @it
comment: Relation between Protected Area and Race

prime minister
type: Class
label: premier ministre @fr

British royalty
type: Class
label: royauté Britannique @fr

race
type: Class
label: course @fr

has Comics Character
type: ObjectProperty
comment: Relazione tra Protected Area e Comics Character @it
domain: protected area
range: comics character
comment: Relation between Protected Area and Comics Character

historic place
type: Class
label: site historique @fr

has Monument
comment: Relazione tra Protected Area e Monument @it
type: ObjectProperty
range: monument
domain: protected area
comment: Relation between Protected Area and Monument

has Hospital
type: ObjectProperty
domain: protected area
comment: Relazione tra Protected Area e Hospital @it
comment: Relation between Protected Area and Hospital
range: hospital

hospital
type: Class
label: hôpital @fr

monument
type: Class

has Ambassador
range: ambassador
domain: protected area
type: ObjectProperty
comment: Relation between Protected Area and Ambassador
comment: Relazione tra Protected Area e Ambassador @it

continent
type: Class
label: ήπειρος @el

president
type: Class
label: président @fr

album
label: Album @de
type: Class

has Military Conflict
type: ObjectProperty
domain: protected area
comment: Relation between Protected Area and Military Conflict
comment: Relazione tra Protected Area e Military Conflict @it
range: military conflict

has University
type: ObjectProperty
comment: Relation between Protected Area and University
range: university
comment: Relazione tra Protected Area e University @it
domain: protected area

has Green Alga
comment: Relazione tra Protected Area e Green Alga @it
domain: protected area
range: green alga
type: ObjectProperty
comment: Relation between Protected Area and Green Alga

moss
label: mousses @fr
type: Class

military unit
label: unité militaire @fr
type: Class

has Airport
comment: Relation between Protected Area and Airport
range: airport
comment: Relazione tra Protected Area e Airport @it
type: ObjectProperty
domain: protected area

has Bone
comment: Relation between Protected Area and Bone
type: ObjectProperty
comment: Relazione tra Protected Area e Bone @it
domain: protected area
range: bone

has Film
domain: protected area
range: film
type: ObjectProperty
comment: Relation between Protected Area and Film
comment: Relazione tra Protected Area e Film @it

has Canadian Football Team
comment: Relazione tra Protected Area e Canadian Football Team @it
domain: protected area
comment: Relation between Protected Area and Canadian Football Team
range: canadian football team
type: ObjectProperty

canadian football team
label: équipe canadienne de football américain @fr
type: Class

has Television Show
type: ObjectProperty
comment: Relazione tra Protected Area e Television Show @it
range: television show
comment: Relation between Protected Area and Television Show
domain: protected area

music genre
label: genre musical @fr
label: género musical @pt
type: Class

cycad
label: cycadophytes @fr
type: Class

writer
label: écrivain @fr
type: Class

architect
type: Class
label: architecte @fr

has Lighthouse
comment: Relazione tra Protected Area e Lighthouse @it
comment: Relation between Protected Area and Lighthouse
type: ObjectProperty
domain: protected area
range: lighthouse

ambassador
label: ambassadeur @fr
type: Class

crustacean
label: crustacés @fr
type: Class

has Mayor
comment: Relation between Protected Area and Mayor
domain: protected area
comment: Relazione tra Protected Area e Mayor @it
range: mayor
type: ObjectProperty

has Office Holder
type: ObjectProperty
comment: Relation between Protected Area and Office Holder
domain: protected area
range: office holder
comment: Relazione tra Protected Area e Office Holder @it

has Criminal
type: ObjectProperty
comment: Relazione tra Protected Area e Criminal @it
comment: Relation between Protected Area and Criminal
range: criminal
domain: protected area

has Non- Profit Organisation
comment: Relation between Protected Area and Non- Profit Organisation
range: non-profit organisation
domain: protected area
comment: Relazione tra Protected Area e Non- Profit Organisation @it
type: ObjectProperty

has Broadcast
comment: Relazione tra Protected Area e Broadcast @it
domain: protected area
comment: Relation between Protected Area and Broadcast
range: broadcast
type: ObjectProperty

has Park
comment: Relation between Protected Area and Park
comment: Relazione tra Protected Area e Park @it
type: ObjectProperty
domain: protected area
range: park
related match: location

Ontology
has author: Andrea Giovanni Nuzzolese
has intent: To represent the encyclopedic knowledge expressed by an object typed as ProtectedArea
extracted from: dbpedia.org
has author: Valentina Presutti
extracted from: en.wikipedia.org
imports: cpannotationschema.owl
comment: ProtectedArea Encyclopedic Knowledge Pattern
has author: Aldo Gangemi

has Band
range: Band
comment: Relation between Protected Area and Band
domain: protected area
type: ObjectProperty
comment: Relazione tra Protected Area e Band @it

has Moss
range: moss
comment: Relazione tra Protected Area e Moss @it
type: ObjectProperty
comment: Relation between Protected Area and Moss
domain: protected area

lighthouse
type: Class
label: phare @fr

has Canadian Football League
domain: protected area
comment: Relazione tra Protected Area e Canadian Football League @it
range: canadian football league
comment: Relation between Protected Area and Canadian Football League
type: ObjectProperty

has American Football Team
domain: protected area
comment: Relazione tra Protected Area e American Football Team @it
type: ObjectProperty
comment: Relation between Protected Area and American Football Team
range: american football team

aircraft
label: avion @fr
type: Class
label: αεροσκάφος @el

has Canal
comment: Relazione tra Protected Area e Canal @it
comment: Relation between Protected Area and Canal
domain: protected area
type: ObjectProperty
range: canal

has Currency
domain: protected area
comment: Relation between Protected Area and Currency
comment: Relazione tra Protected Area e Currency @it
type: ObjectProperty
range: currency

has Legislature
comment: Relazione tra Protected Area e Legislature @it
type: ObjectProperty
domain: protected area
comment: Relation between Protected Area and Legislature
range: legislature

club moss
label: lycopodiopsida @fr
type: Class

has Scientist
comment: Relation between Protected Area and Scientist
comment: Relazione tra Protected Area e Scientist @it
type: ObjectProperty
domain: protected area
range: scientist

reptile
type: Class

legislature
type: Class
label: pouvoir législatif @fr

cave
type: Class
label: grotte @fr

has Disease
comment: Relazione tra Protected Area e Disease @it
domain: protected area
type: ObjectProperty
comment: Relation between Protected Area and Disease
range: disease

airline
type: Class
label: compagnie aérienne @fr

monarch
type: Class
label: monarque @fr

has World Heritage Site
domain: protected area
comment: Relazione tra Protected Area e World Heritage Site @it
comment: Relation between Protected Area and World Heritage Site
type: ObjectProperty
range: World Heritage Site

congressman
label: membre du Congrès @fr
type: Class

has Website
comment: Relazione tra Protected Area e Website @it
range: website
type: ObjectProperty
comment: Relation between Protected Area and Website
domain: protected area

golf player
type: Class
label: golfeur @fr

Gnetophytes
label: gnétophytes @fr
type: Class

space mission
type: Class
label: διαστημική αποστολή @el
label: mission spatiale @fr

has Grape
range: grape
comment: Relazione tra Protected Area e Grape @it
domain: protected area
comment: Relation between Protected Area and Grape
type: ObjectProperty

insect
type: Class
label: insecte @fr

has Automobile
type: ObjectProperty
comment: Relation between Protected Area and Automobile
comment: Relazione tra Protected Area e Automobile @it
domain: protected area
range: automobile

film
type: Class
label: ταινία @el

has Book
range: book
domain: protected area
comment: Relazione tra Protected Area e Book @it
comment: Relation between Protected Area and Book
type: ObjectProperty

has American Football League
type: ObjectProperty
comment: Relation between Protected Area and American Football League
comment: Relazione tra Protected Area e American Football League @it
range: american football league
domain: protected area

has Continent
type: ObjectProperty
comment: Relazione tra Protected Area e Continent @it
comment: Relation between Protected Area and Continent
domain: protected area
range: continent

american football team
type: Class
label: équipe américaine de football américain @fr

Supreme Court of the United States case
label: cas juridique de la Cour suprême des États-Unis @fr
type: Class

chemical compound
label: produit chimique @fr
type: Class

power station
type: Class

has Music Genre
range: music genre
type: ObjectProperty
comment: Relazione tra Protected Area e Music Genre @it
comment: Relation between Protected Area and Music Genre
domain: protected area

Axiom
annotated source: has Village
matching quantification: 1
annotated target: nearestCity

has Military Unit
related match: governingBody
comment: Relazione tra Protected Area e Military Unit @it
comment: Relation between Protected Area and Military Unit
domain: protected area
range: military unit
type: ObjectProperty

fern
label: fougères @fr
type: Class

fungus
type: Class
label: fungi @fr

musical artist
label: artista musical @pt
type: Class
label: musicien @fr

has Monarch
type: ObjectProperty
comment: Relation between Protected Area and Monarch
domain: protected area
range: monarch
comment: Relazione tra Protected Area e Monarch @it

has Boxer
range: boxer
comment: Relation between Protected Area and Boxer
comment: Relazione tra Protected Area e Boxer @it
domain: protected area
type: ObjectProperty

has Aircraft
type: ObjectProperty
comment: Relation between Protected Area and Aircraft
comment: Relazione tra Protected Area e Aircraft @it
domain: protected area
range: aircraft

has Locomotive
comment: Relazione tra Protected Area e Locomotive @it
domain: protected area
range: locomotive
type: ObjectProperty
comment: Relation between Protected Area and Locomotive

park
label: parc @fr
type: Class

has Fungus
range: fungus
comment: Relation between Protected Area and Fungus
domain: protected area
type: ObjectProperty
comment: Relazione tra Protected Area e Fungus @it

american football league
type: Class

has Music Festival
domain: protected area
range: music festival
comment: Relazione tra Protected Area e Music Festival @it
comment: Relation between Protected Area and Music Festival
type: ObjectProperty

musical
type: Class
label: musique @fr

actor
label: Schauspieler @de
type: Class
label: acteur @fr

has Sport
range: sport
domain: protected area
comment: Relazione tra Protected Area e Sport @it
type: ObjectProperty
comment: Relation between Protected Area and Sport

has Ski Area
comment: Relation between Protected Area and Ski Area
domain: protected area
type: ObjectProperty
range: ski area
comment: Relazione tra Protected Area e Ski Area @it

has Philosopher
type: ObjectProperty
domain: protected area
comment: Relazione tra Protected Area e Philosopher @it
range: philosopher
comment: Relation between Protected Area and Philosopher

has Olympics
comment: Relazione tra Protected Area e Olympics @it
range: olympics
comment: Relation between Protected Area and Olympics
type: ObjectProperty
domain: protected area

has Soccer League
range: soccer league
comment: Relation between Protected Area and Soccer League
type: ObjectProperty
comment: Relazione tra Protected Area e Soccer League @it
domain: protected area

Axiom
annotated source: has Insect
annotated target: animal
matching quantification: 1

has Cave
comment: Relazione tra Protected Area e Cave @it
range: cave
domain: protected area
type: ObjectProperty
comment: Relation between Protected Area and Cave

has Comedian
range: comedian
type: ObjectProperty
comment: Relazione tra Protected Area e Comedian @it
comment: Relation between Protected Area and Comedian
domain: protected area

has Musical
comment: Relazione tra Protected Area e Musical @it
type: ObjectProperty
range: musical
comment: Relation between Protected Area and Musical
domain: protected area

mountain
label: Βουνό @el
label: montagne @fr
type: Class

criminal
type: Class
label: criminel @fr

has Christian Bishop
domain: protected area
comment: Relazione tra Protected Area e Christian Bishop @it
range: Christian Bishop
type: ObjectProperty
comment: Relation between Protected Area and Christian Bishop

has Historic Place
comment: Relazione tra Protected Area e Historic Place @it
range: historic place
domain: protected area
comment: Relation between Protected Area and Historic Place
type: ObjectProperty

senator
type: Class
label: sénateur @fr

saint
type: Class

comedian
type: Class
label: comédien @fr

valley
label: vallée @fr
type: Class

green alga
label: algue verte @fr
type: Class

has Album
range: album
comment: Relation between Protected Area and Album
domain: protected area
type: ObjectProperty
comment: Relazione tra Protected Area e Album @it

has Skyscraper
comment: Relation between Protected Area and Skyscraper
comment: Relazione tra Protected Area e Skyscraper @it
range: skyscraper
domain: protected area
type: ObjectProperty

book
label: βιβλίο @el
label: llibre @ca
type: Class
label: livre @fr
label: książka @pl

shopping mall
type: Class
label: centre commercial @fr

bacteria
type: Class
label: bactérie @fr

ski area
type: Class
label: domaine skiable @fr

non-profit organisation
label: organisation à but non lucratif @fr
type: Class

canadian football league
type: Class

has Site Of Special Scientific Interest
domain: protected area
comment: Relation between Protected Area and Site Of Special Scientific Interest
range: Site of Special Scientific Interest
type: ObjectProperty
comment: Relazione tra Protected Area e Site Of Special Scientific Interest @it

has Radio Station
comment: Relazione tra Protected Area e Radio Station @it
range: radio station
type: ObjectProperty
domain: protected area
comment: Relation between Protected Area and Radio Station

mollusca
type: Class
label: mollusque @fr

has Video Game
domain: protected area
type: ObjectProperty
range: video game
comment: Relation between Protected Area and Video Game
comment: Relazione tra Protected Area e Video Game @it

wine region
type: Class
label: région viticole @fr

weapon
type: Class
label: arme @fr

drug
label: médicament @fr
type: Class

has Conifer
range: conifer
comment: Relazione tra Protected Area e Conifer @it
type: ObjectProperty
comment: Relation between Protected Area and Conifer
domain: protected area

magazine
label: περιοδικό @el
type: Class

has Club Moss
type: ObjectProperty
domain: protected area
range: club moss
comment: Relazione tra Protected Area e Club Moss @it
comment: Relation between Protected Area and Club Moss

has Station
type: ObjectProperty
range: station
comment: Relation between Protected Area and Station
comment: Relazione tra Protected Area e Station @it
domain: protected area

has Television Episode
type: ObjectProperty
range: television episode
domain: protected area
comment: Relazione tra Protected Area e Television Episode @it
comment: Relation between Protected Area and Television Episode

has Game
domain: protected area
type: ObjectProperty
range: game
comment: Relation between Protected Area and Game
comment: Relazione tra Protected Area e Game @it

canal
type: Class

military person
label: militaire @fr
type: Class

has Golf Player
comment: Relation between Protected Area and Golf Player
range: golf player
type: ObjectProperty
domain: protected area
comment: Relazione tra Protected Area e Golf Player @it

philosopher
type: Class
label: philosophe @fr

award
type: Class
label: récompense @fr

locomotive
type: Class

has Airline
comment: Relation between Protected Area and Airline
type: ObjectProperty
range: airline
domain: protected area
comment: Relazione tra Protected Area e Airline @it

sport
type: Class

has School
comment: Relation between Protected Area and School
type: ObjectProperty
range: school
comment: Relazione tra Protected Area e School @it
domain: protected area

cricketer
type: Class
label: joueur de cricket @fr

single
type: Class

Band
label: groupe de musique @fr
type: Class
label: Musikgruppe @de
label: banda @pt

university
label: πανεπιστήμιο @el
label: université @fr
type: Class

protein
type: Class
label: protéine @fr

ethnic group
label: groupe ethnique @fr
type: Class

has Single
type: ObjectProperty
comment: Relazione tra Protected Area e Single @it
domain: protected area
comment: Relation between Protected Area and Single
range: single

has Weapon
range: weapon
type: ObjectProperty
comment: Relazione tra Protected Area e Weapon @it
comment: Relation between Protected Area and Weapon
domain: protected area

hotel
label: hôtel @fr
type: Class

music festival
label: festival de musique @fr
type: Class

television episode
label: épisode télévisé @fr
type: Class

has Ship
range: ship
type: ObjectProperty
domain: protected area
comment: Relazione tra Protected Area e Ship @it
comment: Relation between Protected Area and Ship

has Ginkgo
type: ObjectProperty
domain: protected area
comment: Relation between Protected Area and Ginkgo
range: ginkgo
comment: Relazione tra Protected Area e Ginkgo @it

village
type: Class
label: χωριό @el

ice hockey league
label: ligue d'hockey sur glace @fr
type: Class

has Prime Minister
type: ObjectProperty
domain: protected area
comment: Relazione tra Protected Area e Prime Minister @it
comment: Relation between Protected Area and Prime Minister
range: prime minister

has Saint
range: saint
domain: protected area
comment: Relazione tra Protected Area e Saint @it
type: ObjectProperty
comment: Relation between Protected Area and Saint

has Protein
comment: Relation between Protected Area and Protein
type: ObjectProperty
domain: protected area
comment: Relazione tra Protected Area e Protein @it
range: protein

historic building
type: Class
label: bâtiment historique @fr

has Bridge
domain: protected area
type: ObjectProperty
comment: Relation between Protected Area and Bridge
range: bridge
comment: Relazione tra Protected Area e Bridge @it

has Language
domain: protected area
type: ObjectProperty
comment: Relazione tra Protected Area e Language @it
comment: Relation between Protected Area and Language
range: language

has Space Mission
comment: Relation between Protected Area and Space Mission
domain: protected area
type: ObjectProperty
comment: Relazione tra Protected Area e Space Mission @it
range: space mission

office holder
type: Class
label: Amtsinhaber @de
label: titulaire @fr

military conflict
label: conflit militaire @fr
type: Class

website
label: site web @fr
label: Ιστότοπος @el
type: Class

grape
type: Class
label: raisin @fr

has Beverage
range: beverage
comment: Relazione tra Protected Area e Beverage @it
comment: Relation between Protected Area and Beverage
domain: protected area
type: ObjectProperty

has Architect
comment: Relazione tra Protected Area e Architect @it
type: ObjectProperty
range: architect
domain: protected area
comment: Relation between Protected Area and Architect

has Award
comment: Relazione tra Protected Area e Award @it
range: award
type: ObjectProperty
domain: protected area
comment: Relation between Protected Area and Award

has Shopping Mall
range: shopping mall
comment: Relazione tra Protected Area e Shopping Mall @it
type: ObjectProperty
domain: protected area
comment: Relation between Protected Area and Shopping Mall

has Village
related match: nearestCity
type: ObjectProperty
comment: Relation between Protected Area and Village
domain: protected area
range: village
comment: Relazione tra Protected Area e Village @it

has Gnetophytes
comment: Relazione tra Protected Area e Gnetophytes @it
domain: protected area
type: ObjectProperty
range: Gnetophytes
comment: Relation between Protected Area and Gnetophytes

has Chemical Compound
comment: Relazione tra Protected Area e Chemical Compound @it
range: chemical compound
domain: protected area
type: ObjectProperty
comment: Relation between Protected Area and Chemical Compound

has American Football Player
type: ObjectProperty
domain: protected area
comment: Relation between Protected Area and American Football Player
range: american football player
comment: Relazione tra Protected Area e American Football Player @it

has Arachnid
range: arachnid
comment: Relation between Protected Area and Arachnid
type: ObjectProperty
domain: protected area
comment: Relazione tra Protected Area e Arachnid @it

has Bacteria
type: ObjectProperty
domain: protected area
comment: Relation between Protected Area and Bacteria
range: bacteria
comment: Relazione tra Protected Area e Bacteria @it

Christian Bishop
type: Class
label: évêque chrétien @fr

has Road
range: road
type: ObjectProperty
comment: Relazione tra Protected Area e Road @it
comment: Relation between Protected Area and Road
domain: protected area

has Hotel
comment: Relazione tra Protected Area e Hotel @it
comment: Relation between Protected Area and Hotel
type: ObjectProperty
domain: protected area
range: hotel

beverage
type: Class
label: boisson @fr

has Trade Union
comment: Relazione tra Protected Area e Trade Union @it
type: ObjectProperty
domain: protected area
comment: Relation between Protected Area and Trade Union
range: trade union

has Island
domain: protected area
type: ObjectProperty
comment: Relazione tra Protected Area e Island @it
comment: Relation between Protected Area and Island
range: island

has Ice Hockey League
comment: Relation between Protected Area and Ice Hockey League
comment: Relazione tra Protected Area e Ice Hockey League @it
range: ice hockey league
type: ObjectProperty
domain: protected area

planet
label: planète @fr
type: Class

has Writer
range: writer
domain: protected area
comment: Relazione tra Protected Area e Writer @it
comment: Relation between Protected Area and Writer
type: ObjectProperty

scientist
label: Wissenschaftler @de
type: Class
label: scientifique @fr

has Lake
comment: Relation between Protected Area and Lake
domain: protected area
comment: Relazione tra Protected Area e Lake @it
range: lake
type: ObjectProperty

has Fish
range: fish
comment: Relation between Protected Area and Fish
type: ObjectProperty
domain: protected area
comment: Relazione tra Protected Area e Fish @it

olympics
label: Jeux Olympiques @fr
type: Class

has President
domain: protected area
comment: Relation between Protected Area and President
type: ObjectProperty
comment: Relazione tra Protected Area e President @it
range: president

has Cycad
comment: Relation between Protected Area and Cycad
domain: protected area
comment: Relazione tra Protected Area e Cycad @it
range: cycad
type: ObjectProperty

bridge
label: pont @fr
type: Class

has Musical Artist
comment: Relazione tra Protected Area e Musical Artist @it
comment: Relation between Protected Area and Musical Artist
domain: protected area
type: ObjectProperty
range: musical artist

broadcast
type: Class
label: Émission de télévision @fr

has Mollusca
comment: Relation between Protected Area and Mollusca
range: mollusca
type: ObjectProperty
comment: Relazione tra Protected Area e Mollusca @it
domain: protected area

island
type: Class
label: νησί @el
label: île @fr

has Historic Building
comment: Relation between Protected Area and Historic Building
domain: protected area
range: historic building
type: ObjectProperty
comment: Relazione tra Protected Area e Historic Building @it

has Fern
domain: protected area
type: ObjectProperty
range: fern
comment: Relation between Protected Area and Fern
comment: Relazione tra Protected Area e Fern @it

comics character
label: personnage de bandes dessinées @fr
type: Class

has Valley
domain: protected area
comment: Relation between Protected Area and Valley
comment: Relazione tra Protected Area e Valley @it
range: valley
type: ObjectProperty

skyscraper
label: gratte-ciel @fr
type: Class

has Supreme Court Of The United States Case
type: ObjectProperty
comment: Relazione tra Protected Area e Supreme Court Of The United States Case @it
comment: Relation between Protected Area and Supreme Court Of The United States Case
range: Supreme Court of the United States case
domain: protected area

radio station
label: station de radio @fr
type: Class

has Power Station
comment: Relation between Protected Area and Power Station
range: power station
comment: Relazione tra Protected Area e Power Station @it
domain: protected area
type: ObjectProperty

bone
type: Class
label: Knochen @de
label: os @fr

member of parliament
label: membre du Parlement @fr
type: Class

has Stadium
range: stadium
domain: protected area
type: ObjectProperty
comment: Relazione tra Protected Area e Stadium @it
comment: Relation between Protected Area and Stadium

has Planet
comment: Relation between Protected Area and Planet
range: planet
domain: protected area
comment: Relazione tra Protected Area e Planet @it
type: ObjectProperty

has Colour
type: ObjectProperty
domain: protected area
range: colour
comment: Relation between Protected Area and Colour
comment: Relazione tra Protected Area e Colour @it

conifer
label: conifères @fr
type: Class

airport
type: Class
label: Flughafen @de
label: aéroport @fr