has Prime Minister
domain: radio station
type: ObjectProperty
comment: Relation between Radio Station and Prime Minister
comment: Relazione tra Radio Station e Prime Minister @it
range: prime minister

has Film
comment: Relation between Radio Station and Film
comment: Relazione tra Radio Station e Film @it
range: film
domain: radio station
type: ObjectProperty

Axiom
matching quantification: 9
annotated target: area
annotated source: has Island

television show
label: émission de télévision @fr
type: Class

has Lake
range: lake
domain: radio station
comment: Relazione tra Radio Station e Lake @it
comment: Relation between Radio Station and Lake
type: ObjectProperty
related match: area

disease
label: maladie @fr
type: Class

automobile
type: Class

colour
label: χρώμα @el
label: couleur @fr
type: Class

has Flowering Plant
range: flowering plant
domain: radio station
comment: Relazione tra Radio Station e Flowering Plant @it
type: ObjectProperty
comment: Relation between Radio Station and Flowering Plant

Election
label: élection @fr
type: Class

has Musical
comment: Relation between Radio Station and Musical
domain: radio station
range: musical
comment: Relazione tra Radio Station e Musical @it
type: ObjectProperty

Axiom
matching quantification: 1
annotated target: callsignMeaning
annotated source: has Language

has Tennis Player
range: tennis player
comment: Relazione tra Radio Station e Tennis Player @it
comment: Relation between Radio Station and Tennis Player
domain: radio station
type: ObjectProperty

has Colour
domain: radio station
range: colour
comment: Relazione tra Radio Station e Colour @it
comment: Relation between Radio Station and Colour
type: ObjectProperty

american football player
type: Class
label: joueur de football américain @fr

has Non- Profit Organisation
comment: Relazione tra Radio Station e Non- Profit Organisation @it
range: non-profit organisation
comment: Relation between Radio Station and Non- Profit Organisation
type: ObjectProperty
domain: radio station

stadium
label: stade @fr
type: Class

has Chemical Compound
range: chemical compound
domain: radio station
comment: Relazione tra Radio Station e Chemical Compound @it
type: ObjectProperty
comment: Relation between Radio Station and Chemical Compound
related match: callsignMeaning

soccer league
label: ligue de football @fr
type: Class

has Wrestler
comment: Relation between Radio Station and Wrestler
comment: Relazione tra Radio Station e Wrestler @it
domain: radio station
type: ObjectProperty
range: wrestler

has Judge
domain: radio station
type: ObjectProperty
comment: Relation between Radio Station and Judge
range: judge
comment: Relazione tra Radio Station e Judge @it

astronaut
type: Class
label: Astronaut @de
label: astronaute @fr

Axiom
annotated source: has Basketball Team
matching quantification: 5
annotated target: affiliations

has Mammal
comment: Relation between Radio Station and Mammal
range: mammal
type: ObjectProperty
comment: Relazione tra Radio Station e Mammal @it
domain: radio station
related match: callsignMeaning

has Mountain
type: ObjectProperty
range: mountain
comment: Relation between Radio Station and Mountain
comment: Relazione tra Radio Station e Mountain @it
domain: radio station

wrestler
label: lutteur @fr
type: Class

mayor
type: Class
label: maire @fr

pope
type: Class
label: pape @fr

has Lacrosse League
type: ObjectProperty
comment: Relazione tra Radio Station e Lacrosse League @it
domain: radio station
comment: Relation between Radio Station and Lacrosse League
range: lacrosse league

has Scientist
comment: Relation between Radio Station and Scientist
comment: Relazione tra Radio Station e Scientist @it
range: scientist
type: ObjectProperty
domain: radio station

Axiom
annotated target: city
annotated source: has Island
matching quantification: 1

has Award
comment: Relation between Radio Station and Award
comment: Relazione tra Radio Station e Award @it
domain: radio station
type: ObjectProperty
range: award

newspaper
label: journal @fr
type: Class

has Golf League
comment: Relation between Radio Station and Golf League
type: ObjectProperty
range: golf league
domain: radio station
comment: Relazione tra Radio Station e Golf League @it

protected area
type: Class
label: προστατευμένη περιοχή @el
label: aire protégée @fr

game
type: Class
label: jeu @fr

road
label: route @fr
type: Class

has World Heritage Site
type: ObjectProperty
domain: radio station
comment: Relation between Radio Station and World Heritage Site
comment: Relazione tra Radio Station e World Heritage Site @it
range: World Heritage Site

boxer
type: Class
label: boxeur @fr

judge
label: juge @fr
type: Class

Axiom
matching quantification: 7
annotated source: has Ethnic Group
annotated target: format

has American Football Player
domain: radio station
comment: Relazione tra Radio Station e American Football Player @it
type: ObjectProperty
comment: Relation between Radio Station and American Football Player
range: american football player

World Heritage Site
label: site du patrimoine mondial @fr
type: Class

has Television Show
range: television show
domain: radio station
comment: Relation between Radio Station and Television Show
type: ObjectProperty
comment: Relazione tra Radio Station e Television Show @it

has Stadium
comment: Relazione tra Radio Station e Stadium @it
type: ObjectProperty
range: stadium
domain: radio station
comment: Relation between Radio Station and Stadium

language
type: Class
label: langage @fr

station
type: Class

tennis league
label: ligue de tennis @fr
type: Class

Axiom
annotated target: owner
annotated source: has Musical Artist
matching quantification: 1

has Book
related match: callsignMeaning
domain: radio station
type: ObjectProperty
comment: Relation between Radio Station and Book
comment: Relazione tra Radio Station e Book @it
range: book

lake
type: Class
label: lac @fr

has Legislature
comment: Relazione tra Radio Station e Legislature @it
domain: radio station
type: ObjectProperty
comment: Relation between Radio Station and Legislature
range: legislature

Axiom
matching quantification: 15
annotated source: has Language
annotated target: format

has School
comment: Relazione tra Radio Station e School @it
type: ObjectProperty
comment: Relation between Radio Station and School
range: school
domain: radio station
related match: owner

has Boxer
range: boxer
type: ObjectProperty
comment: Relazione tra Radio Station e Boxer @it
comment: Relation between Radio Station and Boxer
domain: radio station

governor
label: gouverneur @fr
type: Class

poker player
label: joueur de poker @fr
type: Class

river
type: Class
label: rivière @fr

Axiom
annotated target: affiliations
annotated source: has Hockey Team
matching quantification: 3

lacrosse league
type: Class
label: ligue de crosse @fr

school
label: école @fr
type: Class

ship
type: Class
label: navire @fr

museum
label: musée @fr
type: Class

has Soccer Player
type: ObjectProperty
comment: Relation between Radio Station and Soccer Player
range: soccer player
comment: Relazione tra Radio Station e Soccer Player @it
domain: radio station

tennis player
label: joueur de tennis @fr
type: Class

has Member Of Parliament
domain: radio station
comment: Relation between Radio Station and Member Of Parliament
range: member of parliament
type: ObjectProperty
comment: Relazione tra Radio Station e Member Of Parliament @it

has Ethnic Group
type: ObjectProperty
comment: Relation between Radio Station and Ethnic Group
domain: radio station
range: ethnic group
comment: Relazione tra Radio Station e Ethnic Group @it
related match: format

video game
type: Class
label: jeux vidéo @fr

trade union
type: Class
label: syndicat professionnel @fr

has American Football League
comment: Relation between Radio Station and American Football League
type: ObjectProperty
comment: Relazione tra Radio Station e American Football League @it
domain: radio station
range: american football league

has Ice Hockey Player
comment: Relation between Radio Station and Ice Hockey Player
type: ObjectProperty
range: ice hockey player
domain: radio station
comment: Relazione tra Radio Station e Ice Hockey Player @it

currency
label: devise @fr
type: Class

Axiom
annotated target: owner
annotated source: has University
matching quantification: 66

British royalty
label: royauté Britannique @fr
type: Class

prime minister
type: Class
label: premier ministre @fr

has Adult Actor
type: ObjectProperty
domain: radio station
comment: Relation between Radio Station and Adult Actor
range: adult actor
comment: Relazione tra Radio Station e Adult Actor @it

historic place
type: Class
label: site historique @fr

has American Football Team
related match: affiliations
range: american football team
comment: Relation between Radio Station and American Football Team
domain: radio station
type: ObjectProperty
comment: Relazione tra Radio Station e American Football Team @it

has Soccer League
comment: Relation between Radio Station and Soccer League
comment: Relazione tra Radio Station e Soccer League @it
domain: radio station
range: soccer league
type: ObjectProperty

race
type: Class
label: course @fr

hospital
type: Class
label: hôpital @fr

has Mountain Range
comment: Relation between Radio Station and Mountain Range
comment: Relazione tra Radio Station e Mountain Range @it
range: mountain range
type: ObjectProperty
domain: radio station

has Cricketer
comment: Relazione tra Radio Station e Cricketer @it
domain: radio station
comment: Relation between Radio Station and Cricketer
type: ObjectProperty
range: cricketer

has British Royalty
type: ObjectProperty
comment: Relazione tra Radio Station e British Royalty @it
comment: Relation between Radio Station and British Royalty
range: British royalty
domain: radio station

has Olympics
range: olympics
type: ObjectProperty
comment: Relation between Radio Station and Olympics
comment: Relazione tra Radio Station e Olympics @it
domain: radio station

Axiom
matching quantification: 11
annotated target: affiliations
annotated source: has American Football Team

continent
label: ήπειρος @el
type: Class

has Architect
domain: radio station
type: ObjectProperty
comment: Relation between Radio Station and Architect
range: architect
comment: Relazione tra Radio Station e Architect @it

album
label: Album @de
type: Class

has Automobile
comment: Relation between Radio Station and Automobile
comment: Relazione tra Radio Station e Automobile @it
type: ObjectProperty
range: automobile
domain: radio station

has Tennis League
comment: Relation between Radio Station and Tennis League
domain: radio station
type: ObjectProperty
range: tennis league
comment: Relazione tra Radio Station e Tennis League @it

president
type: Class
label: président @fr

has Race
comment: Relazione tra Radio Station e Race @it
type: ObjectProperty
comment: Relation between Radio Station and Race
range: race
domain: radio station

Axiom
annotated target: callsignMeaning
matching quantification: 1
annotated source: has Chemical Compound

military unit
label: unité militaire @fr
type: Class

has Protein
comment: Relazione tra Radio Station e Protein @it
comment: Relation between Radio Station and Protein
range: protein
type: ObjectProperty
domain: radio station

has Basketball League
type: ObjectProperty
comment: Relazione tra Radio Station e Basketball League @it
range: basketball league
domain: radio station
comment: Relation between Radio Station and Basketball League

has Game
domain: radio station
type: ObjectProperty
range: game
comment: Relation between Radio Station and Game
comment: Relazione tra Radio Station e Game @it

soccer manager
label: entraîneur de football @fr
type: Class

basketball team
type: Class

has Writer
comment: Relazione tra Radio Station e Writer @it
type: ObjectProperty
domain: radio station
range: writer
comment: Relation between Radio Station and Writer

has Astronaut
comment: Relazione tra Radio Station e Astronaut @it
domain: radio station
comment: Relation between Radio Station and Astronaut
range: astronaut
type: ObjectProperty

has Musical Artist
related match: owner
related match: format
type: ObjectProperty
comment: Relation between Radio Station and Musical Artist
domain: radio station
range: musical artist
comment: Relazione tra Radio Station e Musical Artist @it

has Model
comment: Relation between Radio Station and Model
range: model
domain: radio station
comment: Relazione tra Radio Station e Model @it
type: ObjectProperty

canadian football team
label: équipe canadienne de football américain @fr
type: Class

has Philosopher
type: ObjectProperty
comment: Relation between Radio Station and Philosopher
comment: Relazione tra Radio Station e Philosopher @it
range: philosopher
domain: radio station

writer
label: écrivain @fr
type: Class

Axiom
matching quantification: 23
annotated source: has Village
annotated target: city

has River
comment: Relazione tra Radio Station e River @it
type: ObjectProperty
domain: radio station
range: river
comment: Relation between Radio Station and River

has Anatomical Structure
domain: radio station
comment: Relazione tra Radio Station e Anatomical Structure @it
comment: Relation between Radio Station and Anatomical Structure
range: anatomical structure
type: ObjectProperty

record label
label: label discographique @fr
type: Class

architect
label: architecte @fr
type: Class

has Single
range: single
domain: radio station
comment: Relation between Radio Station and Single
comment: Relazione tra Radio Station e Single @it
type: ObjectProperty

model
label: mannequin @fr
type: Class

Axiom
annotated target: language
matching quantification: 19
annotated source: has Language

has Canadian Football Team
domain: radio station
type: ObjectProperty
comment: Relazione tra Radio Station e Canadian Football Team @it
comment: Relation between Radio Station and Canadian Football Team
range: canadian football team

has Ski Area
comment: Relazione tra Radio Station e Ski Area @it
domain: radio station
comment: Relation between Radio Station and Ski Area
type: ObjectProperty
range: ski area

Axiom
annotated source: has Comedian
matching quantification: 2
annotated target: format

has University
type: ObjectProperty
range: university
comment: Relazione tra Radio Station e University @it
related match: owner
comment: Relation between Radio Station and University
related match: affiliations
related match: city
related match: area
domain: radio station

film festival
type: Class
label: festival du film @fr

has Military Unit
type: ObjectProperty
comment: Relation between Radio Station and Military Unit
domain: radio station
range: military unit
comment: Relazione tra Radio Station e Military Unit @it

has Park
domain: radio station
comment: Relazione tra Radio Station e Park @it
comment: Relation between Radio Station and Park
type: ObjectProperty
range: park

has Baseball Player
type: ObjectProperty
domain: radio station
comment: Relazione tra Radio Station e Baseball Player @it
range: baseball player
comment: Relation between Radio Station and Baseball Player

has Saint
comment: Relazione tra Radio Station e Saint @it
domain: radio station
comment: Relation between Radio Station and Saint
range: saint
type: ObjectProperty

has Hockey Team
comment: Relation between Radio Station and Hockey Team
range: hockey team
comment: Relazione tra Radio Station e Hockey Team @it
domain: radio station
type: ObjectProperty
related match: affiliations

Axiom
annotated target: affiliations
annotated source: has Ice Hockey League
matching quantification: 1

has Sport
type: ObjectProperty
comment: Relazione tra Radio Station e Sport @it
domain: radio station
range: sport
comment: Relation between Radio Station and Sport

has Museum
comment: Relazione tra Radio Station e Museum @it
domain: radio station
range: museum
comment: Relation between Radio Station and Museum
type: ObjectProperty

comics creator
type: Class
label: créateur de bandes dessinées @fr

aircraft
label: avion @fr
type: Class
label: αεροσκάφος @el

Axiom
annotated source: has Lake
annotated target: area
matching quantification: 2

hockey team
label: équipe de hockey @fr
type: Class

Axiom
annotated source: has Album
annotated target: format
matching quantification: 2

has Language
range: language
comment: Relation between Radio Station and Language
comment: Relazione tra Radio Station e Language @it
type: ObjectProperty
domain: radio station
related match: callsignMeaning
related match: language
related match: format

has Space Shuttle
comment: Relazione tra Radio Station e Space Shuttle @it
comment: Relation between Radio Station and Space Shuttle
type: ObjectProperty
range: space shuttle
domain: radio station

has Currency
comment: Relation between Radio Station and Currency
domain: radio station
type: ObjectProperty
comment: Relazione tra Radio Station e Currency @it
range: currency

soccer player
type: Class
label: joueur de football @fr

Axiom
annotated target: city
annotated source: has University
matching quantification: 1

reptile
type: Class

has Disease
comment: Relazione tra Radio Station e Disease @it
type: ObjectProperty
domain: radio station
range: disease
comment: Relation between Radio Station and Disease

legislature
label: pouvoir législatif @fr
type: Class

airline
type: Class
label: compagnie aérienne @fr

has Skyscraper
type: ObjectProperty
comment: Relation between Radio Station and Skyscraper
comment: Relazione tra Radio Station e Skyscraper @it
domain: radio station
range: skyscraper

has Criminal
comment: Relazione tra Radio Station e Criminal @it
domain: radio station
type: ObjectProperty
comment: Relation between Radio Station and Criminal
range: criminal

has Power Station
domain: radio station
type: ObjectProperty
range: power station
comment: Relazione tra Radio Station e Power Station @it
comment: Relation between Radio Station and Power Station

has Historic Place
range: historic place
domain: radio station
comment: Relazione tra Radio Station e Historic Place @it
type: ObjectProperty
comment: Relation between Radio Station and Historic Place

congressman
label: membre du Congrès @fr
type: Class

golf player
type: Class
label: golfeur @fr

Axiom
annotated source: has Continent
annotated target: area
matching quantification: 3

nascar driver
label: pilote de la nascar @fr
type: Class

has Beverage
type: ObjectProperty
comment: Relation between Radio Station and Beverage
domain: radio station
range: beverage
comment: Relazione tra Radio Station e Beverage @it

journalist
label: journaliste @fr
type: Class

space mission
type: Class
label: διαστημική αποστολή @el
label: mission spatiale @fr

has Island
comment: Relation between Radio Station and Island
comment: Relazione tra Radio Station e Island @it
domain: radio station
range: island
type: ObjectProperty
related match: area
related match: city

has President
range: president
domain: radio station
type: ObjectProperty
comment: Relazione tra Radio Station e President @it
comment: Relation between Radio Station and President

has Baseball League
type: ObjectProperty
comment: Relazione tra Radio Station e Baseball League @it
domain: radio station
range: baseball league
comment: Relation between Radio Station and Baseball League

has Hotel
comment: Relazione tra Radio Station e Hotel @it
type: ObjectProperty
range: hotel
domain: radio station
comment: Relation between Radio Station and Hotel

insect
type: Class
label: insecte @fr

film
type: Class
label: ταινία @el

has Trade Union
type: ObjectProperty
comment: Relation between Radio Station and Trade Union
domain: radio station
range: trade union
comment: Relazione tra Radio Station e Trade Union @it

has Drug
comment: Relation between Radio Station and Drug
type: ObjectProperty
domain: radio station
range: drug
comment: Relazione tra Radio Station e Drug @it

american football team
type: Class
label: équipe américaine de football américain @fr

Axiom
annotated target: affiliations
matching quantification: 1
annotated source: has Music Festival

Axiom
annotated target: affiliations
matching quantification: 9
annotated source: has University

has Formula One Racer
range: Formula One racer
comment: Relation between Radio Station and Formula One Racer
domain: radio station
comment: Relazione tra Radio Station e Formula One Racer @it
type: ObjectProperty

Supreme Court of the United States case
type: Class
label: cas juridique de la Cour suprême des États-Unis @fr

chemical compound
label: produit chimique @fr
type: Class

bird
label: oiseau @fr
type: Class

has Comics Character
comment: Relation between Radio Station and Comics Character
comment: Relazione tra Radio Station e Comics Character @it
type: ObjectProperty
domain: radio station
range: comics character

power station
type: Class

Gaelic games player
label: joueur de sports gaéliques @fr
type: Class

has Weapon
comment: Relazione tra Radio Station e Weapon @it
type: ObjectProperty
range: weapon
domain: radio station
comment: Relation between Radio Station and Weapon

musical artist
label: artista musical @pt
type: Class
label: musicien @fr

Axiom
matching quantification: 2
annotated target: area
annotated source: has Protected Area

has College
range: college
comment: Relazione tra Radio Station e College @it
domain: radio station
comment: Relation between Radio Station and College
type: ObjectProperty

has Protected Area
related match: area
comment: Relazione tra Radio Station e Protected Area @it
range: protected area
comment: Relation between Radio Station and Protected Area
type: ObjectProperty
domain: radio station

has Office Holder
comment: Relation between Radio Station and Office Holder
domain: radio station
range: office holder
comment: Relazione tra Radio Station e Office Holder @it
type: ObjectProperty

park
label: parc @fr
type: Class

cardinal
type: Class

Axiom
annotated target: owner
matching quantification: 6
annotated source: has School

rugby player
type: Class
label: joueur de rugby @fr

has Road
domain: radio station
comment: Relation between Radio Station and Road
range: road
type: ObjectProperty
comment: Relazione tra Radio Station e Road @it

has Senator
comment: Relation between Radio Station and Senator
range: senator
domain: radio station
type: ObjectProperty
comment: Relazione tra Radio Station e Senator @it

has Mollusca
comment: Relation between Radio Station and Mollusca
type: ObjectProperty
comment: Relazione tra Radio Station e Mollusca @it
domain: radio station
range: mollusca

american football league
type: Class

has Comedian
related match: format
type: ObjectProperty
comment: Relazione tra Radio Station e Comedian @it
range: comedian
comment: Relation between Radio Station and Comedian
domain: radio station

musical
label: musique @fr
type: Class

has Historic Building
type: ObjectProperty
domain: radio station
comment: Relazione tra Radio Station e Historic Building @it
range: historic building
comment: Relation between Radio Station and Historic Building

has Continent
comment: Relation between Radio Station and Continent
range: continent
domain: radio station
type: ObjectProperty
comment: Relazione tra Radio Station e Continent @it
related match: area

cyclist
label: cycliste @fr
type: Class

has Rugby Player
comment: Relazione tra Radio Station e Rugby Player @it
range: rugby player
type: ObjectProperty
domain: radio station
comment: Relation between Radio Station and Rugby Player

has Shopping Mall
comment: Relazione tra Radio Station e Shopping Mall @it
domain: radio station
range: shopping mall
type: ObjectProperty
comment: Relation between Radio Station and Shopping Mall

has Canadian Football League
range: canadian football league
type: ObjectProperty
comment: Relation between Radio Station and Canadian Football League
domain: radio station
comment: Relazione tra Radio Station e Canadian Football League @it

has Ship
domain: radio station
type: ObjectProperty
range: ship
comment: Relation between Radio Station and Ship
comment: Relazione tra Radio Station e Ship @it

has Canal
type: ObjectProperty
range: canal
domain: radio station
comment: Relazione tra Radio Station e Canal @it
comment: Relation between Radio Station and Canal

has Website
type: ObjectProperty
domain: radio station
comment: Relazione tra Radio Station e Website @it
range: website
comment: Relation between Radio Station and Website

basketball league
label: ligue de basketball @fr
type: Class

mountain
label: Βουνό @el
label: montagne @fr
type: Class

Axiom
annotated target: callsignMeaning
matching quantification: 1
annotated source: has Mammal

criminal
type: Class
label: criminel @fr

has Insect
range: insect
comment: Relazione tra Radio Station e Insect @it
comment: Relation between Radio Station and Insect
domain: radio station
type: ObjectProperty

space shuttle
type: Class
label: navette spatiale @fr

has Congressman
range: congressman
comment: Relazione tra Radio Station e Congressman @it
type: ObjectProperty
domain: radio station
comment: Relation between Radio Station and Congressman

has Golf Player
range: golf player
comment: Relazione tra Radio Station e Golf Player @it
type: ObjectProperty
comment: Relation between Radio Station and Golf Player
domain: radio station

flowering plant
type: Class
label: angiospermes @fr

has Magazine
comment: Relazione tra Radio Station e Magazine @it
comment: Relation between Radio Station and Magazine
range: magazine
domain: radio station
type: ObjectProperty

senator
type: Class
label: sénateur @fr

saint
type: Class

valley
type: Class
label: vallée @fr

comedian
type: Class
label: comédien @fr

has Military Person
domain: radio station
comment: Relation between Radio Station and Military Person
range: military person
comment: Relazione tra Radio Station e Military Person @it
type: ObjectProperty

has Cyclist
range: cyclist
type: ObjectProperty
comment: Relazione tra Radio Station e Cyclist @it
comment: Relation between Radio Station and Cyclist
domain: radio station

convention
type: Class
label: congrès @fr

has Soccer Manager
domain: radio station
range: soccer manager
comment: Relation between Radio Station and Soccer Manager
type: ObjectProperty
comment: Relazione tra Radio Station e Soccer Manager @it

book
label: llibre @ca
label: książka @pl
label: βιβλίο @el
label: livre @fr
type: Class

Axiom
annotated target: area
matching quantification: 4
annotated source: has University

Axiom
annotated target: area
annotated source: has Village
matching quantification: 4

shopping mall
label: centre commercial @fr
type: Class

ski area
type: Class
label: domaine skiable @fr

non-profit organisation
label: organisation à but non lucratif @fr
type: Class

has Music Festival
domain: radio station
type: ObjectProperty
range: music festival
comment: Relazione tra Radio Station e Music Festival @it
comment: Relation between Radio Station and Music Festival
related match: affiliations

has Eurovision Song Contest Entry
domain: radio station
comment: Relazione tra Radio Station e Eurovision Song Contest Entry @it
range: Eurovision song contest entry
type: ObjectProperty
comment: Relation between Radio Station and Eurovision Song Contest Entry

has Mayor
range: mayor
comment: Relation between Radio Station and Mayor
domain: radio station
comment: Relazione tra Radio Station e Mayor @it
type: ObjectProperty

canadian football league
type: Class

has Planet
range: planet
comment: Relazione tra Radio Station e Planet @it
domain: radio station
comment: Relation between Radio Station and Planet
type: ObjectProperty

rugby league
label: ligue de rugby @fr
type: Class

mollusca
label: mollusque @fr
type: Class

has Television Episode
range: television episode
domain: radio station
comment: Relazione tra Radio Station e Television Episode @it
comment: Relation between Radio Station and Television Episode
type: ObjectProperty

Axiom
annotated target: callsignMeaning
matching quantification: 1
annotated source: has Governor

weapon
type: Class
label: arme @fr

has Comics Creator
type: ObjectProperty
comment: Relation between Radio Station and Comics Creator
comment: Relazione tra Radio Station e Comics Creator @it
range: comics creator
domain: radio station

drug
label: médicament @fr
type: Class

Axiom
annotated target: owner
annotated source: has Newspaper
matching quantification: 1

magazine
type: Class
label: περιοδικό @el

has Rugby League
type: ObjectProperty
range: rugby league
domain: radio station
comment: Relazione tra Radio Station e Rugby League @it
comment: Relation between Radio Station and Rugby League

has Aircraft
range: aircraft
comment: Relazione tra Radio Station e Aircraft @it
comment: Relation between Radio Station and Aircraft
domain: radio station
type: ObjectProperty

canal
type: Class

military person
type: Class
label: militaire @fr

philosopher
label: philosophe @fr
type: Class

award
label: récompense @fr
type: Class

Axiom
annotated source: has Book
matching quantification: 1
annotated target: callsignMeaning

has Station
comment: Relazione tra Radio Station e Station @it
domain: radio station
comment: Relation between Radio Station and Station
type: ObjectProperty
range: station

locomotive
type: Class

has Film Festival
domain: radio station
type: ObjectProperty
comment: Relazione tra Radio Station e Film Festival @it
comment: Relation between Radio Station and Film Festival
range: film festival

college
type: Class

anatomical structure
type: Class
label: structure anatomique @fr

sport
type: Class

has Band
comment: Relazione tra Radio Station e Band @it
range: Band
comment: Relation between Radio Station and Band
domain: radio station
type: ObjectProperty

cricketer
type: Class
label: joueur de cricket @fr

single
type: Class

Band
label: banda @pt
label: Musikgruppe @de
type: Class
label: groupe de musique @fr

Axiom
annotated target: format
annotated source: has Musical Artist
matching quantification: 1

university
type: Class
label: université @fr
label: πανεπιστήμιο @el

has Christian Bishop
comment: Relazione tra Radio Station e Christian Bishop @it
range: Christian Bishop
type: ObjectProperty
comment: Relation between Radio Station and Christian Bishop
domain: radio station

protein
type: Class
label: protéine @fr

has Newspaper
related match: owner
range: newspaper
comment: Relazione tra Radio Station e Newspaper @it
type: ObjectProperty
comment: Relation between Radio Station and Newspaper
domain: radio station

ethnic group
label: groupe ethnique @fr
type: Class

has Convention
comment: Relazione tra Radio Station e Convention @it
comment: Relation between Radio Station and Convention
domain: radio station
type: ObjectProperty
range: convention

has College Coach
comment: Relazione tra Radio Station e College Coach @it
comment: Relation between Radio Station and College Coach
type: ObjectProperty
domain: radio station
range: college coach

hotel
type: Class
label: hôtel @fr

music festival
type: Class
label: festival de musique @fr

has Video Game
type: ObjectProperty
range: video game
comment: Relazione tra Radio Station e Video Game @it
domain: radio station
comment: Relation between Radio Station and Video Game

college coach
label: entraîneur universitaire @fr
type: Class

has Basketball Player
domain: radio station
comment: Relation between Radio Station and Basketball Player
type: ObjectProperty
range: basketball player
comment: Relazione tra Radio Station e Basketball Player @it

television episode
label: épisode télévisé @fr
type: Class

has Locomotive
comment: Relazione tra Radio Station e Locomotive @it
type: ObjectProperty
range: locomotive
domain: radio station
comment: Relation between Radio Station and Locomotive

has Journalist
type: ObjectProperty
range: journalist
domain: radio station
comment: Relazione tra Radio Station e Journalist @it
comment: Relation between Radio Station and Journalist

village
type: Class
label: χωριό @el

ice hockey league
type: Class
label: ligue d'hockey sur glace @fr

has Hospital
range: hospital
comment: Relation between Radio Station and Hospital
domain: radio station
comment: Relazione tra Radio Station e Hospital @it
type: ObjectProperty

has Supreme Court Of The United States Case
type: ObjectProperty
comment: Relation between Radio Station and Supreme Court Of The United States Case
comment: Relazione tra Radio Station e Supreme Court Of The United States Case @it
domain: radio station
range: Supreme Court of the United States case

has Airline
comment: Relation between Radio Station and Airline
range: airline
type: ObjectProperty
comment: Relazione tra Radio Station e Airline @it
domain: radio station

has Space Mission
domain: radio station
type: ObjectProperty
range: space mission
comment: Relation between Radio Station and Space Mission
comment: Relazione tra Radio Station e Space Mission @it

soccer club
label: club de football @fr
type: Class

historic building
label: bâtiment historique @fr
type: Class

has Military Conflict
domain: radio station
comment: Relation between Radio Station and Military Conflict
range: military conflict
comment: Relazione tra Radio Station e Military Conflict @it
type: ObjectProperty

office holder
label: titulaire @fr
label: Amtsinhaber @de
type: Class

baseball player
type: Class
label: joueur de baseball @fr

military conflict
type: Class
label: conflit militaire @fr

has Pope
comment: Relation between Radio Station and Pope
type: ObjectProperty
range: pope
domain: radio station
comment: Relazione tra Radio Station e Pope @it

website
label: Ιστότοπος @el
label: site web @fr
type: Class

has Valley
comment: Relation between Radio Station and Valley
domain: radio station
range: valley
type: ObjectProperty
comment: Relazione tra Radio Station e Valley @it

has Reptile
domain: radio station
type: ObjectProperty
range: reptile
comment: Relation between Radio Station and Reptile
comment: Relazione tra Radio Station e Reptile @it

basketball player
label: joueur de basketball @fr
type: Class

adult actor
label: acteur adulte @fr
type: Class
label: erwachsener Schauspieler @de

has Basketball Team
related match: affiliations
range: basketball team
domain: radio station
type: ObjectProperty
comment: Relazione tra Radio Station e Basketball Team @it
comment: Relation between Radio Station and Basketball Team

ice hockey player
label: joueur de hockey sur glace @fr
type: Class

has Poker Player
comment: Relazione tra Radio Station e Poker Player @it
domain: radio station
range: poker player
comment: Relation between Radio Station and Poker Player
type: ObjectProperty

Christian Bishop
label: évêque chrétien @fr
type: Class

mountain range
type: Class
label: chaîne de montagne @fr

has Ice Hockey League
comment: Relation between Radio Station and Ice Hockey League
domain: radio station
range: ice hockey league
comment: Relazione tra Radio Station e Ice Hockey League @it
type: ObjectProperty
related match: affiliations

beverage
label: boisson @fr
type: Class

has Election
type: ObjectProperty
comment: Relation between Radio Station and Election
domain: radio station
range: Election
comment: Relazione tra Radio Station e Election @it

Ontology
comment: RadioStation Encyclopedic Knowledge Pattern
has intent: To represent the encyclopedic knowledge expressed by an object typed as RadioStation
has author: Valentina Presutti
has author: Aldo Gangemi
extracted from: en.wikipedia.org
extracted from: dbpedia.org
has author: Andrea Giovanni Nuzzolese
imports: cpannotationschema.owl

Axiom
annotated source: has Soccer Club
matching quantification: 1
annotated target: owner

planet
label: planète @fr
type: Class

has Bird
comment: Relazione tra Radio Station e Bird @it
comment: Relation between Radio Station and Bird
range: bird
domain: radio station
type: ObjectProperty

scientist
label: Wissenschaftler @de
type: Class
label: scientifique @fr

golf league
type: Class
label: ligue de golf @fr

has Record Label
domain: radio station
comment: Relation between Radio Station and Record Label
range: record label
type: ObjectProperty
comment: Relazione tra Radio Station e Record Label @it

olympics
type: Class
label: Jeux Olympiques @fr

baseball league
label: ligue de baseball @fr
type: Class

has Village
related match: city
related match: area
range: village
domain: radio station
type: ObjectProperty
comment: Relazione tra Radio Station e Village @it
comment: Relation between Radio Station and Village

bridge
type: Class
label: pont @fr

has Nascar Driver
comment: Relazione tra Radio Station e Nascar Driver @it
domain: radio station
type: ObjectProperty
comment: Relation between Radio Station and Nascar Driver
range: nascar driver

has Gaelic Games Player
type: ObjectProperty
comment: Relazione tra Radio Station e Gaelic Games Player @it
comment: Relation between Radio Station and Gaelic Games Player
domain: radio station
range: Gaelic games player

mammal
label: mammifère @fr
type: Class

has Album
comment: Relation between Radio Station and Album
type: ObjectProperty
comment: Relazione tra Radio Station e Album @it
range: album
domain: radio station
related match: format

Eurovision song contest entry
label: concours Eurovision de la chanson @fr
type: Class

island
type: Class
label: νησί @el
label: île @fr

comics character
label: personnage de bandes dessinées @fr
type: Class

has Soccer Club
related match: owner
range: soccer club
type: ObjectProperty
comment: Relation between Radio Station and Soccer Club
domain: radio station
comment: Relazione tra Radio Station e Soccer Club @it

Formula One racer
type: Class
label: pilote de formule 1 @fr

skyscraper
type: Class
label: gratte-ciel @fr

radio station
type: Class
label: station de radio @fr

has Bridge
domain: radio station
type: ObjectProperty
comment: Relazione tra Radio Station e Bridge @it
comment: Relation between Radio Station and Bridge
range: bridge

member of parliament
type: Class
label: membre du Parlement @fr

has Airport
type: ObjectProperty
comment: Relation between Radio Station and Airport
domain: radio station
comment: Relazione tra Radio Station e Airport @it
range: airport

has Cardinal
comment: Relazione tra Radio Station e Cardinal @it
domain: radio station
range: cardinal
comment: Relation between Radio Station and Cardinal
type: ObjectProperty

airport
label: aéroport @fr
label: Flughafen @de
type: Class

has Governor
related match: callsignMeaning
domain: radio station
comment: Relation between Radio Station and Governor
range: governor
type: ObjectProperty
comment: Relazione tra Radio Station e Governor @it