television show
label: émission de télévision @fr
type: Class

has Skyscraper
comment: Relation between Shopping Mall and Skyscraper
range: skyscraper
domain: shopping mall
comment: Relazione tra Shopping Mall e Skyscraper @it
type: ObjectProperty

disease
label: maladie @fr
type: Class

has Governor
domain: shopping mall
range: governor
comment: Relation between Shopping Mall and Governor
type: ObjectProperty
comment: Relazione tra Shopping Mall e Governor @it

has World Heritage Site
comment: Relation between Shopping Mall and World Heritage Site
type: ObjectProperty
domain: shopping mall
comment: Relazione tra Shopping Mall e World Heritage Site @it
range: World Heritage Site

colour
type: Class
label: couleur @fr
label: χρώμα @el

has Single
domain: shopping mall
range: single
comment: Relation between Shopping Mall and Single
type: ObjectProperty
comment: Relazione tra Shopping Mall e Single @it

automobile
type: Class

has Architect
domain: shopping mall
type: ObjectProperty
comment: Relazione tra Shopping Mall e Architect @it
comment: Relation between Shopping Mall and Architect
range: architect

has Office Holder
comment: Relation between Shopping Mall and Office Holder
domain: shopping mall
range: office holder
comment: Relazione tra Shopping Mall e Office Holder @it
type: ObjectProperty

has Tennis League
comment: Relazione tra Shopping Mall e Tennis League @it
range: tennis league
domain: shopping mall
type: ObjectProperty
comment: Relation between Shopping Mall and Tennis League

american football player
type: Class
label: joueur de football américain @fr

stadium
label: stade @fr
type: Class

has Military Unit
domain: shopping mall
range: military unit
comment: Relation between Shopping Mall and Military Unit
comment: Relazione tra Shopping Mall e Military Unit @it
type: ObjectProperty

has Olympics
comment: Relation between Shopping Mall and Olympics
range: olympics
comment: Relazione tra Shopping Mall e Olympics @it
domain: shopping mall
type: ObjectProperty

wrestler
type: Class
label: lutteur @fr

mayor
label: maire @fr
type: Class

has Locomotive
range: locomotive
domain: shopping mall
comment: Relation between Shopping Mall and Locomotive
type: ObjectProperty
comment: Relazione tra Shopping Mall e Locomotive @it

newspaper
type: Class
label: journal @fr

protected area
label: aire protégée @fr
label: προστατευμένη περιοχή @el
type: Class

has Actor
comment: Relazione tra Shopping Mall e Actor @it
domain: shopping mall
range: actor
comment: Relation between Shopping Mall and Actor
type: ObjectProperty

has Journalist
comment: Relation between Shopping Mall and Journalist
comment: Relazione tra Shopping Mall e Journalist @it
range: journalist
domain: shopping mall
type: ObjectProperty

boxer
label: boxeur @fr
type: Class

World Heritage Site
label: site du patrimoine mondial @fr
type: Class

has Mayor
range: mayor
type: ObjectProperty
comment: Relazione tra Shopping Mall e Mayor @it
domain: shopping mall
comment: Relation between Shopping Mall and Mayor

has Weapon
comment: Relation between Shopping Mall and Weapon
type: ObjectProperty
comment: Relazione tra Shopping Mall e Weapon @it
range: weapon
domain: shopping mall

station
type: Class

language
label: langage @fr
type: Class

has Bird
range: bird
comment: Relazione tra Shopping Mall e Bird @it
type: ObjectProperty
comment: Relation between Shopping Mall and Bird
domain: shopping mall

has Criminal
range: criminal
type: ObjectProperty
domain: shopping mall
comment: Relazione tra Shopping Mall e Criminal @it
comment: Relation between Shopping Mall and Criminal

has Currency
type: ObjectProperty
comment: Relation between Shopping Mall and Currency
range: currency
comment: Relazione tra Shopping Mall e Currency @it
domain: shopping mall

Axiom
matching quantification: 1
annotated target: source
annotated source: has Writer

tennis league
type: Class
label: ligue de tennis @fr

has Language
domain: shopping mall
comment: Relazione tra Shopping Mall e Language @it
range: language
comment: Relation between Shopping Mall and Language
type: ObjectProperty

lake
label: lac @fr
type: Class

has Wrestler
type: ObjectProperty
comment: Relazione tra Shopping Mall e Wrestler @it
comment: Relation between Shopping Mall and Wrestler
range: wrestler
domain: shopping mall

has River
comment: Relazione tra Shopping Mall e River @it
domain: shopping mall
comment: Relation between Shopping Mall and River
range: river
type: ObjectProperty

has Writer
type: ObjectProperty
comment: Relazione tra Shopping Mall e Writer @it
range: writer
domain: shopping mall
comment: Relation between Shopping Mall and Writer
related match: source

governor
label: gouverneur @fr
type: Class

has Automobile
domain: shopping mall
comment: Relation between Shopping Mall and Automobile
comment: Relazione tra Shopping Mall e Automobile @it
type: ObjectProperty
range: automobile

has Ice Hockey Player
type: ObjectProperty
domain: shopping mall
comment: Relazione tra Shopping Mall e Ice Hockey Player @it
comment: Relation between Shopping Mall and Ice Hockey Player
range: ice hockey player

has Comedian
type: ObjectProperty
comment: Relation between Shopping Mall and Comedian
domain: shopping mall
range: comedian
comment: Relazione tra Shopping Mall e Comedian @it

river
type: Class
label: rivière @fr

school
label: école @fr
type: Class

fish
label: poisson @fr
type: Class

museum
label: musée @fr
type: Class

ship
type: Class
label: navire @fr

tennis player
type: Class
label: joueur de tennis @fr

video game
type: Class
label: jeux vidéo @fr

trade union
type: Class
label: syndicat professionnel @fr

has Historic Building
type: ObjectProperty
range: historic building
domain: shopping mall
comment: Relation between Shopping Mall and Historic Building
comment: Relazione tra Shopping Mall e Historic Building @it

currency
type: Class
label: devise @fr

British royalty
type: Class
label: royauté Britannique @fr

prime minister
type: Class
label: premier ministre @fr

historic place
label: site historique @fr
type: Class

hospital
type: Class
label: hôpital @fr

monument
type: Class

has Museum
range: museum
comment: Relazione tra Shopping Mall e Museum @it
type: ObjectProperty
comment: Relation between Shopping Mall and Museum
domain: shopping mall

has Radio Station
type: ObjectProperty
domain: shopping mall
comment: Relation between Shopping Mall and Radio Station
range: radio station
comment: Relazione tra Shopping Mall e Radio Station @it

has Disease
range: disease
domain: shopping mall
comment: Relation between Shopping Mall and Disease
type: ObjectProperty
comment: Relazione tra Shopping Mall e Disease @it

has Christian Bishop
comment: Relation between Shopping Mall and Christian Bishop
range: Christian Bishop
type: ObjectProperty
domain: shopping mall
comment: Relazione tra Shopping Mall e Christian Bishop @it

continent
label: ήπειρος @el
type: Class

president
type: Class
label: président @fr

album
label: Album @de
type: Class

figure skater
label: patineur artistique @fr
type: Class

military unit
label: unité militaire @fr
type: Class

basketball team
type: Class

music genre
label: genre musical @fr
label: género musical @pt
type: Class

writer
type: Class
label: écrivain @fr

has Basketball Team
domain: shopping mall
comment: Relation between Shopping Mall and Basketball Team
type: ObjectProperty
range: basketball team
comment: Relazione tra Shopping Mall e Basketball Team @it

has Lake
range: lake
type: ObjectProperty
domain: shopping mall
comment: Relazione tra Shopping Mall e Lake @it
comment: Relation between Shopping Mall and Lake

architect
type: Class
label: architecte @fr

model
type: Class
label: mannequin @fr

has Beverage
comment: Relazione tra Shopping Mall e Beverage @it
domain: shopping mall
comment: Relation between Shopping Mall and Beverage
type: ObjectProperty
range: beverage

has Senator
range: senator
type: ObjectProperty
comment: Relation between Shopping Mall and Senator
domain: shopping mall
comment: Relazione tra Shopping Mall e Senator @it

has Music Genre
range: music genre
type: ObjectProperty
domain: shopping mall
comment: Relation between Shopping Mall and Music Genre
comment: Relazione tra Shopping Mall e Music Genre @it

has Book
type: ObjectProperty
comment: Relazione tra Shopping Mall e Book @it
domain: shopping mall
comment: Relation between Shopping Mall and Book
range: book

has Flowering Plant
type: ObjectProperty
comment: Relation between Shopping Mall and Flowering Plant
domain: shopping mall
range: flowering plant
comment: Relazione tra Shopping Mall e Flowering Plant @it

has Golf League
range: golf league
comment: Relation between Shopping Mall and Golf League
domain: shopping mall
comment: Relazione tra Shopping Mall e Golf League @it
type: ObjectProperty

film festival
type: Class
label: festival du film @fr

has Planet
range: planet
domain: shopping mall
comment: Relazione tra Shopping Mall e Planet @it
comment: Relation between Shopping Mall and Planet
type: ObjectProperty

has School
type: ObjectProperty
domain: shopping mall
comment: Relation between Shopping Mall and School
range: school
comment: Relazione tra Shopping Mall e School @it

has Magazine
domain: shopping mall
comment: Relation between Shopping Mall and Magazine
comment: Relazione tra Shopping Mall e Magazine @it
type: ObjectProperty
range: magazine

has Basketball League
comment: Relazione tra Shopping Mall e Basketball League @it
type: ObjectProperty
domain: shopping mall
comment: Relation between Shopping Mall and Basketball League
range: basketball league

hockey team
type: Class
label: équipe de hockey @fr

has Philosopher
type: ObjectProperty
comment: Relation between Shopping Mall and Philosopher
domain: shopping mall
comment: Relazione tra Shopping Mall e Philosopher @it
range: philosopher

legislature
type: Class
label: pouvoir législatif @fr

has President
comment: Relation between Shopping Mall and President
domain: shopping mall
range: president
comment: Relazione tra Shopping Mall e President @it
type: ObjectProperty

airline
type: Class
label: compagnie aérienne @fr

has Congressman
type: ObjectProperty
domain: shopping mall
range: congressman
comment: Relation between Shopping Mall and Congressman
comment: Relazione tra Shopping Mall e Congressman @it

monarch
type: Class
label: monarque @fr

has Insect
comment: Relation between Shopping Mall and Insect
type: ObjectProperty
domain: shopping mall
range: insect
comment: Relazione tra Shopping Mall e Insect @it

congressman
label: membre du Congrès @fr
type: Class

has Sport
domain: shopping mall
range: sport
comment: Relation between Shopping Mall and Sport
type: ObjectProperty
comment: Relazione tra Shopping Mall e Sport @it

nascar driver
label: pilote de la nascar @fr
type: Class

journalist
label: journaliste @fr
type: Class

has Canal
domain: shopping mall
comment: Relation between Shopping Mall and Canal
type: ObjectProperty
comment: Relazione tra Shopping Mall e Canal @it
range: canal

has Ski Area
type: ObjectProperty
range: ski area
domain: shopping mall
comment: Relation between Shopping Mall and Ski Area
comment: Relazione tra Shopping Mall e Ski Area @it

has Video Game
range: video game
domain: shopping mall
comment: Relazione tra Shopping Mall e Video Game @it
type: ObjectProperty
comment: Relation between Shopping Mall and Video Game

insect
label: insecte @fr
type: Class

film
type: Class
label: ταινία @el

american football team
label: équipe américaine de football américain @fr
type: Class

has Airline
comment: Relation between Shopping Mall and Airline
comment: Relazione tra Shopping Mall e Airline @it
domain: shopping mall
type: ObjectProperty
range: airline

has Park
domain: shopping mall
type: ObjectProperty
range: park
comment: Relation between Shopping Mall and Park
comment: Relazione tra Shopping Mall e Park @it

has Television Episode
comment: Relazione tra Shopping Mall e Television Episode @it
domain: shopping mall
type: ObjectProperty
comment: Relation between Shopping Mall and Television Episode
range: television episode

bird
label: oiseau @fr
type: Class

chemical compound
type: Class
label: produit chimique @fr

has Broadcast
comment: Relazione tra Shopping Mall e Broadcast @it
range: broadcast
domain: shopping mall
type: ObjectProperty
comment: Relation between Shopping Mall and Broadcast

musical artist
label: musicien @fr
type: Class
label: artista musical @pt

has Conifer
comment: Relation between Shopping Mall and Conifer
domain: shopping mall
range: conifer
type: ObjectProperty
comment: Relazione tra Shopping Mall e Conifer @it

has Hospital
domain: shopping mall
range: hospital
type: ObjectProperty
comment: Relation between Shopping Mall and Hospital
comment: Relazione tra Shopping Mall e Hospital @it

park
type: Class
label: parc @fr

has Historic Place
type: ObjectProperty
comment: Relation between Shopping Mall and Historic Place
domain: shopping mall
range: historic place
comment: Relazione tra Shopping Mall e Historic Place @it

has Non- Profit Organisation
type: ObjectProperty
comment: Relation between Shopping Mall and Non- Profit Organisation
domain: shopping mall
comment: Relazione tra Shopping Mall e Non- Profit Organisation @it
range: non-profit organisation

has Musical
domain: shopping mall
comment: Relation between Shopping Mall and Musical
type: ObjectProperty
range: musical
comment: Relazione tra Shopping Mall e Musical @it

has Village
type: ObjectProperty
domain: shopping mall
range: village
comment: Relation between Shopping Mall and Village
comment: Relazione tra Shopping Mall e Village @it
related match: location

has Mountain Range
domain: shopping mall
type: ObjectProperty
comment: Relation between Shopping Mall and Mountain Range
comment: Relazione tra Shopping Mall e Mountain Range @it
range: mountain range

musical
label: musique @fr
type: Class

has Model
comment: Relazione tra Shopping Mall e Model @it
domain: shopping mall
comment: Relation between Shopping Mall and Model
type: ObjectProperty
range: model

actor
label: Schauspieler @de
type: Class
label: acteur @fr

has British Royalty
range: British royalty
type: ObjectProperty
domain: shopping mall
comment: Relation between Shopping Mall and British Royalty
comment: Relazione tra Shopping Mall e British Royalty @it

has Colour
domain: shopping mall
type: ObjectProperty
range: colour
comment: Relazione tra Shopping Mall e Colour @it
comment: Relation between Shopping Mall and Colour

has Station
comment: Relation between Shopping Mall and Station
type: ObjectProperty
domain: shopping mall
range: station
comment: Relazione tra Shopping Mall e Station @it

has Mountain
comment: Relation between Shopping Mall and Mountain
range: mountain
type: ObjectProperty
comment: Relazione tra Shopping Mall e Mountain @it
domain: shopping mall

has Town
comment: Relation between Shopping Mall and Town
range: town
type: ObjectProperty
comment: Relazione tra Shopping Mall e Town @it
domain: shopping mall

has Soccer Club
domain: shopping mall
comment: Relazione tra Shopping Mall e Soccer Club @it
type: ObjectProperty
comment: Relation between Shopping Mall and Soccer Club
range: soccer club

basketball league
type: Class
label: ligue de basketball @fr

mountain
type: Class
label: montagne @fr
label: Βουνό @el

has Film
comment: Relazione tra Shopping Mall e Film @it
comment: Relation between Shopping Mall and Film
domain: shopping mall
type: ObjectProperty
range: film

criminal
type: Class
label: criminel @fr

has Television Show
type: ObjectProperty
comment: Relazione tra Shopping Mall e Television Show @it
range: television show
comment: Relation between Shopping Mall and Television Show
domain: shopping mall

flowering plant
label: angiospermes @fr
type: Class

has Figure Skater
range: figure skater
domain: shopping mall
type: ObjectProperty
comment: Relation between Shopping Mall and Figure Skater
comment: Relazione tra Shopping Mall e Figure Skater @it

senator
label: sénateur @fr
type: Class

comedian
type: Class
label: comédien @fr

has American Football Player
domain: shopping mall
range: american football player
type: ObjectProperty
comment: Relation between Shopping Mall and American Football Player
comment: Relazione tra Shopping Mall e American Football Player @it

book
type: Class
label: livre @fr
label: βιβλίο @el
label: llibre @ca
label: książka @pl

has Drug
range: drug
type: ObjectProperty
domain: shopping mall
comment: Relation between Shopping Mall and Drug
comment: Relazione tra Shopping Mall e Drug @it

shopping mall
type: Class
label: centre commercial @fr

ski area
type: Class
label: domaine skiable @fr

has Restaurant
comment: Relation between Shopping Mall and Restaurant
type: ObjectProperty
range: restaurant
comment: Relazione tra Shopping Mall e Restaurant @it
domain: shopping mall

non-profit organisation
type: Class
label: organisation à but non lucratif @fr

has Monarch
comment: Relazione tra Shopping Mall e Monarch @it
range: monarch
type: ObjectProperty
domain: shopping mall
comment: Relation between Shopping Mall and Monarch

has Legislature
comment: Relazione tra Shopping Mall e Legislature @it
type: ObjectProperty
domain: shopping mall
comment: Relation between Shopping Mall and Legislature
range: legislature

weapon
label: arme @fr
type: Class

has Continent
type: ObjectProperty
comment: Relation between Shopping Mall and Continent
comment: Relazione tra Shopping Mall e Continent @it
range: continent
domain: shopping mall

drug
type: Class
label: médicament @fr

has Monument
range: monument
comment: Relazione tra Shopping Mall e Monument @it
comment: Relation between Shopping Mall and Monument
type: ObjectProperty
domain: shopping mall

has Airport
type: ObjectProperty
comment: Relazione tra Shopping Mall e Airport @it
domain: shopping mall
comment: Relation between Shopping Mall and Airport
range: airport

Axiom
annotated source: has Village
matching quantification: 1
annotated target: location

has Stadium
comment: Relation between Shopping Mall and Stadium
type: ObjectProperty
comment: Relazione tra Shopping Mall e Stadium @it
range: stadium
domain: shopping mall

magazine
type: Class
label: περιοδικό @el

has Hockey Team
type: ObjectProperty
comment: Relazione tra Shopping Mall e Hockey Team @it
comment: Relation between Shopping Mall and Hockey Team
domain: shopping mall
range: hockey team

has Fish
type: ObjectProperty
comment: Relation between Shopping Mall and Fish
domain: shopping mall
range: fish
comment: Relazione tra Shopping Mall e Fish @it

canal
type: Class

military person
label: militaire @fr
type: Class

has Bridge
comment: Relation between Shopping Mall and Bridge
comment: Relazione tra Shopping Mall e Bridge @it
type: ObjectProperty
domain: shopping mall
range: bridge

philosopher
type: Class
label: philosophe @fr

has Musical Artist
type: ObjectProperty
domain: shopping mall
comment: Relation between Shopping Mall and Musical Artist
range: musical artist
comment: Relazione tra Shopping Mall e Musical Artist @it

has Military Person
type: ObjectProperty
comment: Relazione tra Shopping Mall e Military Person @it
comment: Relation between Shopping Mall and Military Person
range: military person
domain: shopping mall

locomotive
type: Class

sport
type: Class

restaurant
type: Class

has Nascar Driver
comment: Relation between Shopping Mall and Nascar Driver
comment: Relazione tra Shopping Mall e Nascar Driver @it
type: ObjectProperty
range: nascar driver
domain: shopping mall

has Chemical Compound
domain: shopping mall
type: ObjectProperty
comment: Relazione tra Shopping Mall e Chemical Compound @it
range: chemical compound
comment: Relation between Shopping Mall and Chemical Compound

single
type: Class

Band
label: banda @pt
label: Musikgruppe @de
type: Class
label: groupe de musique @fr

town
label: ville @fr
type: Class

has Tennis Player
domain: shopping mall
comment: Relazione tra Shopping Mall e Tennis Player @it
range: tennis player
type: ObjectProperty
comment: Relation between Shopping Mall and Tennis Player

university
type: Class
label: université @fr
label: πανεπιστήμιο @el

ethnic group
label: groupe ethnique @fr
type: Class

has Album
comment: Relazione tra Shopping Mall e Album @it
range: album
type: ObjectProperty
comment: Relation between Shopping Mall and Album
domain: shopping mall

has Boxer
type: ObjectProperty
comment: Relazione tra Shopping Mall e Boxer @it
comment: Relation between Shopping Mall and Boxer
domain: shopping mall
range: boxer

hotel
type: Class
label: hôtel @fr

has Protected Area
range: protected area
type: ObjectProperty
comment: Relazione tra Shopping Mall e Protected Area @it
comment: Relation between Shopping Mall and Protected Area
domain: shopping mall

has Band
type: ObjectProperty
comment: Relazione tra Shopping Mall e Band @it
range: Band
domain: shopping mall
comment: Relation between Shopping Mall and Band

television episode
label: épisode télévisé @fr
type: Class

village
label: χωριό @el
type: Class

has Film Festival
comment: Relazione tra Shopping Mall e Film Festival @it
domain: shopping mall
type: ObjectProperty
comment: Relation between Shopping Mall and Film Festival
range: film festival

ice hockey league
type: Class
label: ligue d'hockey sur glace @fr

has Military Conflict
domain: shopping mall
comment: Relation between Shopping Mall and Military Conflict
range: military conflict
type: ObjectProperty
comment: Relazione tra Shopping Mall e Military Conflict @it

soccer club
label: club de football @fr
type: Class

historic building
label: bâtiment historique @fr
type: Class

has Mammal
range: mammal
comment: Relation between Shopping Mall and Mammal
comment: Relazione tra Shopping Mall e Mammal @it
type: ObjectProperty
domain: shopping mall

office holder
type: Class
label: Amtsinhaber @de
label: titulaire @fr

Ontology
has author: Aldo Gangemi
has intent: To represent the encyclopedic knowledge expressed by an object typed as ShoppingMall
extracted from: dbpedia.org
has author: Valentina Presutti
extracted from: en.wikipedia.org
has author: Andrea Giovanni Nuzzolese
imports: cpannotationschema.owl
comment: ShoppingMall Encyclopedic Knowledge Pattern

baseball player
type: Class
label: joueur de baseball @fr

military conflict
type: Class
label: conflit militaire @fr

website
label: site web @fr
label: Ιστότοπος @el
type: Class

has Newspaper
type: ObjectProperty
comment: Relation between Shopping Mall and Newspaper
domain: shopping mall
comment: Relazione tra Shopping Mall e Newspaper @it
range: newspaper

has Hotel
comment: Relazione tra Shopping Mall e Hotel @it
domain: shopping mall
comment: Relation between Shopping Mall and Hotel
type: ObjectProperty
range: hotel

has Trade Union
domain: shopping mall
comment: Relazione tra Shopping Mall e Trade Union @it
comment: Relation between Shopping Mall and Trade Union
range: trade union
type: ObjectProperty

basketball player
type: Class
label: joueur de basketball @fr

ice hockey player
label: joueur de hockey sur glace @fr
type: Class

has University
type: ObjectProperty
range: university
comment: Relation between Shopping Mall and University
domain: shopping mall
comment: Relazione tra Shopping Mall e University @it

has Website
type: ObjectProperty
range: website
domain: shopping mall
comment: Relazione tra Shopping Mall e Website @it
comment: Relation between Shopping Mall and Website

has Ice Hockey League
comment: Relazione tra Shopping Mall e Ice Hockey League @it
domain: shopping mall
type: ObjectProperty
comment: Relation between Shopping Mall and Ice Hockey League
range: ice hockey league

mountain range
label: chaîne de montagne @fr
type: Class

Christian Bishop
type: Class
label: évêque chrétien @fr

beverage
type: Class
label: boisson @fr

has Ship
type: ObjectProperty
range: ship
domain: shopping mall
comment: Relation between Shopping Mall and Ship
comment: Relazione tra Shopping Mall e Ship @it

has Member Of Parliament
type: ObjectProperty
comment: Relazione tra Shopping Mall e Member Of Parliament @it
comment: Relation between Shopping Mall and Member Of Parliament
domain: shopping mall
range: member of parliament

has Prime Minister
type: ObjectProperty
domain: shopping mall
comment: Relazione tra Shopping Mall e Prime Minister @it
comment: Relation between Shopping Mall and Prime Minister
range: prime minister

planet
label: planète @fr
type: Class

has Island
comment: Relation between Shopping Mall and Island
domain: shopping mall
comment: Relazione tra Shopping Mall e Island @it
range: island
type: ObjectProperty

has Comics Character
type: ObjectProperty
range: comics character
domain: shopping mall
comment: Relazione tra Shopping Mall e Comics Character @it
comment: Relation between Shopping Mall and Comics Character

golf league
label: ligue de golf @fr
type: Class

has Ethnic Group
comment: Relazione tra Shopping Mall e Ethnic Group @it
comment: Relation between Shopping Mall and Ethnic Group
type: ObjectProperty
range: ethnic group
domain: shopping mall

olympics
label: Jeux Olympiques @fr
type: Class

has Basketball Player
type: ObjectProperty
comment: Relazione tra Shopping Mall e Basketball Player @it
domain: shopping mall
comment: Relation between Shopping Mall and Basketball Player
range: basketball player

bridge
type: Class
label: pont @fr

has American Football Team
range: american football team
type: ObjectProperty
comment: Relazione tra Shopping Mall e American Football Team @it
comment: Relation between Shopping Mall and American Football Team
domain: shopping mall

broadcast
type: Class
label: Émission de télévision @fr

has Baseball Player
domain: shopping mall
comment: Relazione tra Shopping Mall e Baseball Player @it
range: baseball player
comment: Relation between Shopping Mall and Baseball Player
type: ObjectProperty

mammal
type: Class
label: mammifère @fr

island
label: île @fr
label: νησί @el
type: Class

comics character
label: personnage de bandes dessinées @fr
type: Class

skyscraper
label: gratte-ciel @fr
type: Class

radio station
type: Class
label: station de radio @fr

member of parliament
type: Class
label: membre du Parlement @fr

conifer
type: Class
label: conifères @fr

airport
type: Class
label: Flughafen @de
label: aéroport @fr