has Military Conflict
range: military conflict
type: ObjectProperty
comment: Relazione tra Skyscraper e Military Conflict @it
domain: skyscraper
comment: Relation between Skyscraper and Military Conflict

has Stadium
comment: Relation between Skyscraper and Stadium
type: ObjectProperty
comment: Relazione tra Skyscraper e Stadium @it
range: stadium
domain: skyscraper
related match: location

television show
type: Class
label: émission de télévision @fr

disease
label: maladie @fr
type: Class

has Legislature
domain: skyscraper
range: legislature
type: ObjectProperty
comment: Relazione tra Skyscraper e Legislature @it
comment: Relation between Skyscraper and Legislature

has Album
range: album
comment: Relation between Skyscraper and Album
type: ObjectProperty
comment: Relazione tra Skyscraper e Album @it
domain: skyscraper

has University
related match: before
range: university
comment: Relation between Skyscraper and University
type: ObjectProperty
domain: skyscraper
comment: Relazione tra Skyscraper e University @it

colour
label: χρώμα @el
label: couleur @fr
type: Class

automobile
type: Class

Election
type: Class
label: élection @fr

has Actor
comment: Relazione tra Skyscraper e Actor @it
type: ObjectProperty
range: actor
domain: skyscraper
comment: Relation between Skyscraper and Actor

american football player
type: Class
label: joueur de football américain @fr

has Journalist
comment: Relazione tra Skyscraper e Journalist @it
range: journalist
comment: Relation between Skyscraper and Journalist
domain: skyscraper
type: ObjectProperty

has Drug
comment: Relation between Skyscraper and Drug
range: drug
domain: skyscraper
comment: Relazione tra Skyscraper e Drug @it
type: ObjectProperty

stadium
label: stade @fr
type: Class

has Continent
type: ObjectProperty
domain: skyscraper
comment: Relazione tra Skyscraper e Continent @it
comment: Relation between Skyscraper and Continent
range: continent

has American Football League
type: ObjectProperty
comment: Relazione tra Skyscraper e American Football League @it
range: american football league
domain: skyscraper
comment: Relation between Skyscraper and American Football League

wrestler
type: Class
label: lutteur @fr

mayor
type: Class
label: maire @fr

has American Football Team
comment: Relazione tra Skyscraper e American Football Team @it
type: ObjectProperty
domain: skyscraper
range: american football team
comment: Relation between Skyscraper and American Football Team

amphibian
type: Class
label: amphibien @fr

has Station
domain: skyscraper
comment: Relazione tra Skyscraper e Station @it
range: station
comment: Relation between Skyscraper and Station
type: ObjectProperty
related match: after
related match: before

has Senator
type: ObjectProperty
domain: skyscraper
range: senator
comment: Relation between Skyscraper and Senator
comment: Relazione tra Skyscraper e Senator @it

has Golf Player
domain: skyscraper
range: golf player
comment: Relation between Skyscraper and Golf Player
type: ObjectProperty
comment: Relazione tra Skyscraper e Golf Player @it

has Ice Hockey League
comment: Relazione tra Skyscraper e Ice Hockey League @it
range: ice hockey league
type: ObjectProperty
comment: Relation between Skyscraper and Ice Hockey League
domain: skyscraper

has Saint
domain: skyscraper
range: saint
comment: Relation between Skyscraper and Saint
comment: Relazione tra Skyscraper e Saint @it
type: ObjectProperty

newspaper
label: journal @fr
type: Class

game
label: jeu @fr
type: Class

protected area
label: aire protégée @fr
label: προστατευμένη περιοχή @el
type: Class

has Sport
comment: Relation between Skyscraper and Sport
domain: skyscraper
range: sport
type: ObjectProperty
comment: Relazione tra Skyscraper e Sport @it

road
label: route @fr
type: Class

has Member Of Parliament
comment: Relazione tra Skyscraper e Member Of Parliament @it
range: member of parliament
comment: Relation between Skyscraper and Member Of Parliament
type: ObjectProperty
domain: skyscraper

judge
type: Class
label: juge @fr

World Heritage Site
type: Class
label: site du patrimoine mondial @fr

has Mammal
type: ObjectProperty
range: mammal
comment: Relation between Skyscraper and Mammal
domain: skyscraper
comment: Relazione tra Skyscraper e Mammal @it

has Colour
comment: Relazione tra Skyscraper e Colour @it
domain: skyscraper
comment: Relation between Skyscraper and Colour
type: ObjectProperty
range: colour

station
type: Class

language
label: langage @fr
type: Class

has Single
range: single
domain: skyscraper
comment: Relazione tra Skyscraper e Single @it
type: ObjectProperty
comment: Relation between Skyscraper and Single

lake
label: lac @fr
type: Class

has Automobile
domain: skyscraper
comment: Relation between Skyscraper and Automobile
range: automobile
comment: Relazione tra Skyscraper e Automobile @it
type: ObjectProperty

has Scientist
domain: skyscraper
range: scientist
type: ObjectProperty
comment: Relation between Skyscraper and Scientist
comment: Relazione tra Skyscraper e Scientist @it

governor
label: gouverneur @fr
type: Class

has Writer
range: writer
comment: Relation between Skyscraper and Writer
comment: Relazione tra Skyscraper e Writer @it
type: ObjectProperty
domain: skyscraper

has Cricketer
comment: Relazione tra Skyscraper e Cricketer @it
range: cricketer
type: ObjectProperty
comment: Relation between Skyscraper and Cricketer
domain: skyscraper

river
type: Class
label: rivière @fr

has Mountain
comment: Relation between Skyscraper and Mountain
type: ObjectProperty
comment: Relazione tra Skyscraper e Mountain @it
range: mountain
domain: skyscraper

school
type: Class
label: école @fr

ship
label: navire @fr
type: Class

museum
label: musée @fr
type: Class

tennis player
type: Class
label: joueur de tennis @fr

video game
label: jeux vidéo @fr
type: Class

has Fungus
comment: Relazione tra Skyscraper e Fungus @it
range: fungus
domain: skyscraper
comment: Relation between Skyscraper and Fungus
type: ObjectProperty

has Hockey Team
comment: Relazione tra Skyscraper e Hockey Team @it
domain: skyscraper
range: hockey team
comment: Relation between Skyscraper and Hockey Team
type: ObjectProperty

trade union
type: Class
label: syndicat professionnel @fr

has Basketball Team
domain: skyscraper
range: basketball team
type: ObjectProperty
comment: Relation between Skyscraper and Basketball Team
comment: Relazione tra Skyscraper e Basketball Team @it

currency
type: Class
label: devise @fr

prime minister
type: Class
label: premier ministre @fr

has Office Holder
domain: skyscraper
type: ObjectProperty
comment: Relation between Skyscraper and Office Holder
comment: Relazione tra Skyscraper e Office Holder @it
range: office holder

British royalty
type: Class
label: royauté Britannique @fr

historic place
label: site historique @fr
type: Class

has Weapon
comment: Relation between Skyscraper and Weapon
comment: Relazione tra Skyscraper e Weapon @it
domain: skyscraper
range: weapon
type: ObjectProperty

hospital
type: Class
label: hôpital @fr

has Road
comment: Relazione tra Skyscraper e Road @it
type: ObjectProperty
comment: Relation between Skyscraper and Road
range: road
domain: skyscraper
related match: location

has Band
type: ObjectProperty
domain: skyscraper
comment: Relazione tra Skyscraper e Band @it
range: Band
comment: Relation between Skyscraper and Band

has Baseball Player
type: ObjectProperty
range: baseball player
comment: Relation between Skyscraper and Baseball Player
domain: skyscraper
comment: Relazione tra Skyscraper e Baseball Player @it

has Video Game
type: ObjectProperty
comment: Relation between Skyscraper and Video Game
range: video game
comment: Relazione tra Skyscraper e Video Game @it
domain: skyscraper

has Architect
domain: skyscraper
comment: Relazione tra Skyscraper e Architect @it
comment: Relation between Skyscraper and Architect
range: architect
type: ObjectProperty
related match: architect

continent
type: Class
label: ήπειρος @el

president
type: Class
label: président @fr

album
label: Album @de
type: Class

has Basketball Player
type: ObjectProperty
comment: Relation between Skyscraper and Basketball Player
range: basketball player
domain: skyscraper
comment: Relazione tra Skyscraper e Basketball Player @it

military unit
type: Class
label: unité militaire @fr

has Space Mission
comment: Relazione tra Skyscraper e Space Mission @it
type: ObjectProperty
range: space mission
comment: Relation between Skyscraper and Space Mission
domain: skyscraper

has Basketball League
type: ObjectProperty
comment: Relazione tra Skyscraper e Basketball League @it
range: basketball league
comment: Relation between Skyscraper and Basketball League
domain: skyscraper

basketball team
type: Class

has Historic Place
type: ObjectProperty
domain: skyscraper
comment: Relazione tra Skyscraper e Historic Place @it
range: historic place
comment: Relation between Skyscraper and Historic Place
related match: after
related match: before

Axiom
annotated source: has Hotel
annotated target: before
matching quantification: 1

canadian football team
label: équipe canadienne de football américain @fr
type: Class

music genre
label: genre musical @fr
label: género musical @pt
type: Class

writer
label: écrivain @fr
type: Class

record label
label: label discographique @fr
type: Class

has Musical Artist
range: musical artist
domain: skyscraper
type: ObjectProperty
comment: Relazione tra Skyscraper e Musical Artist @it
comment: Relation between Skyscraper and Musical Artist

has Museum
comment: Relation between Skyscraper and Museum
range: museum
type: ObjectProperty
comment: Relazione tra Skyscraper e Museum @it
domain: skyscraper

architect
type: Class
label: architecte @fr

ambassador
type: Class
label: ambassadeur @fr

has Philosopher
domain: skyscraper
comment: Relation between Skyscraper and Philosopher
comment: Relazione tra Skyscraper e Philosopher @it
type: ObjectProperty
range: philosopher

has Mountain Range
type: ObjectProperty
domain: skyscraper
comment: Relazione tra Skyscraper e Mountain Range @it
range: mountain range
comment: Relation between Skyscraper and Mountain Range

has Olympics
comment: Relation between Skyscraper and Olympics
type: ObjectProperty
comment: Relazione tra Skyscraper e Olympics @it
domain: skyscraper
range: olympics

film festival
label: festival du film @fr
type: Class

has Website
comment: Relation between Skyscraper and Website
range: website
domain: skyscraper
comment: Relazione tra Skyscraper e Website @it
type: ObjectProperty

has British Royalty
range: British royalty
type: ObjectProperty
comment: Relazione tra Skyscraper e British Royalty @it
domain: skyscraper
comment: Relation between Skyscraper and British Royalty

Axiom
annotated source: has Park
annotated target: location
matching quantification: 1

lighthouse
type: Class
label: phare @fr

comics creator
type: Class
label: créateur de bandes dessinées @fr

aircraft
label: αεροσκάφος @el
type: Class
label: avion @fr

has Island
range: island
comment: Relazione tra Skyscraper e Island @it
domain: skyscraper
type: ObjectProperty
comment: Relation between Skyscraper and Island

hockey team
type: Class
label: équipe de hockey @fr

has Supreme Court Of The United States Case
comment: Relation between Skyscraper and Supreme Court Of The United States Case
comment: Relazione tra Skyscraper e Supreme Court Of The United States Case @it
domain: skyscraper
range: Supreme Court of the United States case
type: ObjectProperty

has Bridge
domain: skyscraper
range: bridge
type: ObjectProperty
comment: Relation between Skyscraper and Bridge
comment: Relazione tra Skyscraper e Bridge @it

reptile
type: Class

legislature
type: Class
label: pouvoir législatif @fr

has Comedian
domain: skyscraper
comment: Relation between Skyscraper and Comedian
type: ObjectProperty
comment: Relazione tra Skyscraper e Comedian @it
range: comedian

has Language
range: language
domain: skyscraper
comment: Relazione tra Skyscraper e Language @it
comment: Relation between Skyscraper and Language
type: ObjectProperty

airline
label: compagnie aérienne @fr
type: Class

monarch
label: monarque @fr
type: Class

has Nascar Driver
comment: Relazione tra Skyscraper e Nascar Driver @it
comment: Relation between Skyscraper and Nascar Driver
type: ObjectProperty
range: nascar driver
domain: skyscraper

congressman
label: membre du Congrès @fr
type: Class

Axiom
matching quantification: 1
annotated source: has Stadium
annotated target: location

golf player
label: golfeur @fr
type: Class

nascar driver
type: Class
label: pilote de la nascar @fr

has Bird
range: bird
type: ObjectProperty
domain: skyscraper
comment: Relazione tra Skyscraper e Bird @it
comment: Relation between Skyscraper and Bird

space mission
type: Class
label: διαστημική αποστολή @el
label: mission spatiale @fr

journalist
type: Class
label: journaliste @fr

insect
label: insecte @fr
type: Class

film
type: Class
label: ταινία @el

has Flowering Plant
type: ObjectProperty
range: flowering plant
comment: Relation between Skyscraper and Flowering Plant
domain: skyscraper
comment: Relazione tra Skyscraper e Flowering Plant @it

has Wrestler
domain: skyscraper
comment: Relation between Skyscraper and Wrestler
comment: Relazione tra Skyscraper e Wrestler @it
range: wrestler
type: ObjectProperty

american football team
label: équipe américaine de football américain @fr
type: Class

Supreme Court of the United States case
label: cas juridique de la Cour suprême des États-Unis @fr
type: Class

has Music Genre
domain: skyscraper
type: ObjectProperty
comment: Relazione tra Skyscraper e Music Genre @it
comment: Relation between Skyscraper and Music Genre
range: music genre

bird
label: oiseau @fr
type: Class

chemical compound
type: Class
label: produit chimique @fr

has Non- Profit Organisation
comment: Relation between Skyscraper and Non- Profit Organisation
domain: skyscraper
range: non-profit organisation
type: ObjectProperty
comment: Relazione tra Skyscraper e Non- Profit Organisation @it

power station
type: Class

has Hotel
comment: Relazione tra Skyscraper e Hotel @it
type: ObjectProperty
range: hotel
domain: skyscraper
comment: Relation between Skyscraper and Hotel
related match: before
related match: after

fungus
type: Class
label: fungi @fr

musical artist
label: musicien @fr
type: Class
label: artista musical @pt

has Ice Hockey Player
type: ObjectProperty
comment: Relation between Skyscraper and Ice Hockey Player
range: ice hockey player
domain: skyscraper
comment: Relazione tra Skyscraper e Ice Hockey Player @it

has Canal
domain: skyscraper
type: ObjectProperty
comment: Relazione tra Skyscraper e Canal @it
comment: Relation between Skyscraper and Canal
range: canal

Axiom
matching quantification: 1
annotated source: has Station
annotated target: before

has Monarch
range: monarch
comment: Relazione tra Skyscraper e Monarch @it
comment: Relation between Skyscraper and Monarch
domain: skyscraper
type: ObjectProperty

has Currency
comment: Relazione tra Skyscraper e Currency @it
type: ObjectProperty
comment: Relation between Skyscraper and Currency
range: currency
domain: skyscraper

Axiom
matching quantification: 2
annotated source: has University
annotated target: before

has Planet
range: planet
comment: Relazione tra Skyscraper e Planet @it
comment: Relation between Skyscraper and Planet
type: ObjectProperty
domain: skyscraper

has Restaurant
domain: skyscraper
comment: Relazione tra Skyscraper e Restaurant @it
comment: Relation between Skyscraper and Restaurant
type: ObjectProperty
range: restaurant

park
type: Class
label: parc @fr

american football league
type: Class

has Award
range: award
comment: Relation between Skyscraper and Award
type: ObjectProperty
comment: Relazione tra Skyscraper e Award @it
domain: skyscraper

musical
type: Class
label: musique @fr

actor
label: Schauspieler @de
type: Class
label: acteur @fr

Axiom
annotated target: location
annotated source: has Road
matching quantification: 3

has Protected Area
range: protected area
comment: Relation between Skyscraper and Protected Area
comment: Relazione tra Skyscraper e Protected Area @it
type: ObjectProperty
domain: skyscraper

has World Heritage Site
comment: Relazione tra Skyscraper e World Heritage Site @it
domain: skyscraper
comment: Relation between Skyscraper and World Heritage Site
type: ObjectProperty
range: World Heritage Site
related match: before
related match: after

has Trade Union
range: trade union
comment: Relation between Skyscraper and Trade Union
type: ObjectProperty
comment: Relazione tra Skyscraper e Trade Union @it
domain: skyscraper

has Town
type: ObjectProperty
range: town
comment: Relation between Skyscraper and Town
comment: Relazione tra Skyscraper e Town @it
domain: skyscraper

Axiom
matching quantification: 21
annotated target: before
annotated source: has Historic Place

basketball league
label: ligue de basketball @fr
type: Class

mountain
label: Βουνό @el
label: montagne @fr
type: Class

criminal
type: Class
label: criminel @fr

flowering plant
type: Class
label: angiospermes @fr

has Ethnic Group
domain: skyscraper
type: ObjectProperty
comment: Relazione tra Skyscraper e Ethnic Group @it
range: ethnic group
comment: Relation between Skyscraper and Ethnic Group

Ontology
extracted from: dbpedia.org
has author: Andrea Giovanni Nuzzolese
extracted from: en.wikipedia.org
has author: Valentina Presutti
has intent: To represent the encyclopedic knowledge expressed by an object typed as Skyscraper
has author: Aldo Gangemi
imports: cpannotationschema.owl
comment: Skyscraper Encyclopedic Knowledge Pattern

has Film Festival
comment: Relazione tra Skyscraper e Film Festival @it
range: film festival
domain: skyscraper
comment: Relation between Skyscraper and Film Festival
type: ObjectProperty

senator
label: sénateur @fr
type: Class

has Amphibian
range: amphibian
type: ObjectProperty
comment: Relation between Skyscraper and Amphibian
domain: skyscraper
comment: Relazione tra Skyscraper e Amphibian @it

has Airline
comment: Relazione tra Skyscraper e Airline @it
type: ObjectProperty
range: airline
comment: Relation between Skyscraper and Airline
domain: skyscraper

saint
type: Class

comedian
type: Class
label: comédien @fr

valley
label: vallée @fr
type: Class

has Television Show
comment: Relation between Skyscraper and Television Show
range: television show
type: ObjectProperty
comment: Relazione tra Skyscraper e Television Show @it
domain: skyscraper

green alga
type: Class
label: algue verte @fr

has Beverage
comment: Relazione tra Skyscraper e Beverage @it
type: ObjectProperty
range: beverage
comment: Relation between Skyscraper and Beverage
domain: skyscraper

convention
type: Class
label: congrès @fr

book
type: Class
label: livre @fr
label: βιβλίο @el
label: książka @pl
label: llibre @ca

has Congressman
type: ObjectProperty
domain: skyscraper
range: congressman
comment: Relazione tra Skyscraper e Congressman @it
comment: Relation between Skyscraper and Congressman

Axiom
matching quantification: 8
annotated target: after
annotated source: has Historic Place

has Canadian Football Team
comment: Relazione tra Skyscraper e Canadian Football Team @it
range: canadian football team
comment: Relation between Skyscraper and Canadian Football Team
domain: skyscraper
type: ObjectProperty

shopping mall
label: centre commercial @fr
type: Class

has Book
range: book
domain: skyscraper
type: ObjectProperty
comment: Relation between Skyscraper and Book
comment: Relazione tra Skyscraper e Book @it

has Election
domain: skyscraper
comment: Relation between Skyscraper and Election
range: Election
comment: Relazione tra Skyscraper e Election @it
type: ObjectProperty

has Military Person
domain: skyscraper
comment: Relation between Skyscraper and Military Person
range: military person
comment: Relazione tra Skyscraper e Military Person @it
type: ObjectProperty

has Comics Character
comment: Relazione tra Skyscraper e Comics Character @it
type: ObjectProperty
range: comics character
comment: Relation between Skyscraper and Comics Character
domain: skyscraper

non-profit organisation
label: organisation à but non lucratif @fr
type: Class

mollusca
type: Class
label: mollusque @fr

Axiom
annotated source: has Historic Building
matching quantification: 2
annotated target: before

has Shopping Mall
domain: skyscraper
comment: Relazione tra Skyscraper e Shopping Mall @it
range: shopping mall
type: ObjectProperty
comment: Relation between Skyscraper and Shopping Mall

weapon
type: Class
label: arme @fr

drug
label: médicament @fr
type: Class

has Ambassador
range: ambassador
type: ObjectProperty
comment: Relation between Skyscraper and Ambassador
domain: skyscraper
comment: Relazione tra Skyscraper e Ambassador @it

has Convention
comment: Relazione tra Skyscraper e Convention @it
domain: skyscraper
range: convention
type: ObjectProperty
comment: Relation between Skyscraper and Convention

Axiom
annotated source: has Hotel
annotated target: after
matching quantification: 2

has Ship
comment: Relazione tra Skyscraper e Ship @it
type: ObjectProperty
comment: Relation between Skyscraper and Ship
domain: skyscraper
range: ship

magazine
label: περιοδικό @el
type: Class

has Hospital
type: ObjectProperty
comment: Relazione tra Skyscraper e Hospital @it
range: hospital
comment: Relation between Skyscraper and Hospital
domain: skyscraper

has Park
related match: location
comment: Relazione tra Skyscraper e Park @it
domain: skyscraper
type: ObjectProperty
comment: Relation between Skyscraper and Park
range: park

canal
type: Class

military person
type: Class
label: militaire @fr

philosopher
label: philosophe @fr
type: Class

has Criminal
range: criminal
type: ObjectProperty
domain: skyscraper
comment: Relazione tra Skyscraper e Criminal @it
comment: Relation between Skyscraper and Criminal

award
type: Class
label: récompense @fr

has Reptile
domain: skyscraper
type: ObjectProperty
comment: Relation between Skyscraper and Reptile
range: reptile
comment: Relazione tra Skyscraper e Reptile @it

sport
type: Class

has Airport
type: ObjectProperty
comment: Relazione tra Skyscraper e Airport @it
comment: Relation between Skyscraper and Airport
range: airport
domain: skyscraper

has School
type: ObjectProperty
comment: Relazione tra Skyscraper e School @it
range: school
domain: skyscraper
comment: Relation between Skyscraper and School

has Prime Minister
domain: skyscraper
range: prime minister
comment: Relazione tra Skyscraper e Prime Minister @it
type: ObjectProperty
comment: Relation between Skyscraper and Prime Minister

restaurant
type: Class

cricketer
type: Class
label: joueur de cricket @fr

single
type: Class

Band
label: banda @pt
label: Musikgruppe @de
type: Class
label: groupe de musique @fr

town
type: Class
label: ville @fr

Axiom
annotated source: has Architect
annotated target: architect
matching quantification: 18

has Village
domain: skyscraper
range: village
comment: Relation between Skyscraper and Village
type: ObjectProperty
comment: Relazione tra Skyscraper e Village @it

has Conifer
domain: skyscraper
range: conifer
type: ObjectProperty
comment: Relation between Skyscraper and Conifer
comment: Relazione tra Skyscraper e Conifer @it

has Lighthouse
type: ObjectProperty
range: lighthouse
comment: Relazione tra Skyscraper e Lighthouse @it
domain: skyscraper
comment: Relation between Skyscraper and Lighthouse

university
type: Class
label: université @fr
label: πανεπιστήμιο @el

has American Football Player
comment: Relazione tra Skyscraper e American Football Player @it
comment: Relation between Skyscraper and American Football Player
range: american football player
domain: skyscraper
type: ObjectProperty

has Record Label
comment: Relazione tra Skyscraper e Record Label @it
range: record label
type: ObjectProperty
domain: skyscraper
comment: Relation between Skyscraper and Record Label

ethnic group
type: Class
label: groupe ethnique @fr

has Insect
domain: skyscraper
range: insect
type: ObjectProperty
comment: Relation between Skyscraper and Insect
comment: Relazione tra Skyscraper e Insect @it

has Broadcast
domain: skyscraper
comment: Relazione tra Skyscraper e Broadcast @it
comment: Relation between Skyscraper and Broadcast
type: ObjectProperty
range: broadcast

embryology
label: embryologie @fr
type: Class

has Disease
domain: skyscraper
range: disease
comment: Relazione tra Skyscraper e Disease @it
type: ObjectProperty
comment: Relation between Skyscraper and Disease

Axiom
annotated source: has World Heritage Site
matching quantification: 1
annotated target: before

hotel
label: hôtel @fr
type: Class

has Lake
type: ObjectProperty
comment: Relazione tra Skyscraper e Lake @it
range: lake
domain: skyscraper
comment: Relation between Skyscraper and Lake

has Musical
comment: Relation between Skyscraper and Musical
domain: skyscraper
type: ObjectProperty
range: musical
comment: Relazione tra Skyscraper e Musical @it

television episode
type: Class
label: épisode télévisé @fr

village
label: χωριό @el
type: Class

ice hockey league
type: Class
label: ligue d'hockey sur glace @fr

Axiom
annotated target: after
matching quantification: 1
annotated source: has Station

has Soccer Club
comment: Relazione tra Skyscraper e Soccer Club @it
comment: Relation between Skyscraper and Soccer Club
domain: skyscraper
type: ObjectProperty
range: soccer club

has President
domain: skyscraper
comment: Relazione tra Skyscraper e President @it
type: ObjectProperty
range: president
comment: Relation between Skyscraper and President

has Mollusca
range: mollusca
domain: skyscraper
comment: Relazione tra Skyscraper e Mollusca @it
comment: Relation between Skyscraper and Mollusca
type: ObjectProperty

has Judge
comment: Relation between Skyscraper and Judge
type: ObjectProperty
range: judge
comment: Relazione tra Skyscraper e Judge @it
domain: skyscraper

has Governor
type: ObjectProperty
comment: Relazione tra Skyscraper e Governor @it
domain: skyscraper
range: governor
comment: Relation between Skyscraper and Governor

has Tennis Player
range: tennis player
comment: Relazione tra Skyscraper e Tennis Player @it
comment: Relation between Skyscraper and Tennis Player
domain: skyscraper
type: ObjectProperty

soccer club
type: Class
label: club de football @fr

historic building
type: Class
label: bâtiment historique @fr

baseball player
label: joueur de baseball @fr
type: Class

office holder
label: titulaire @fr
label: Amtsinhaber @de
type: Class

military conflict
label: conflit militaire @fr
type: Class

website
type: Class
label: site web @fr
label: Ιστότοπος @el

has Film
comment: Relazione tra Skyscraper e Film @it
domain: skyscraper
range: film
type: ObjectProperty
comment: Relation between Skyscraper and Film

has Game
comment: Relazione tra Skyscraper e Game @it
domain: skyscraper
range: game
type: ObjectProperty
comment: Relation between Skyscraper and Game

has Valley
domain: skyscraper
comment: Relazione tra Skyscraper e Valley @it
range: valley
type: ObjectProperty
comment: Relation between Skyscraper and Valley

has Baseball League
range: baseball league
comment: Relation between Skyscraper and Baseball League
type: ObjectProperty
domain: skyscraper
comment: Relazione tra Skyscraper e Baseball League @it

basketball player
label: joueur de basketball @fr
type: Class

has Chemical Compound
comment: Relazione tra Skyscraper e Chemical Compound @it
type: ObjectProperty
domain: skyscraper
comment: Relation between Skyscraper and Chemical Compound
range: chemical compound

Axiom
annotated source: has World Heritage Site
annotated target: after
matching quantification: 1

ice hockey player
type: Class
label: joueur de hockey sur glace @fr

has Magazine
domain: skyscraper
comment: Relation between Skyscraper and Magazine
range: magazine
type: ObjectProperty
comment: Relazione tra Skyscraper e Magazine @it

has Newspaper
type: ObjectProperty
range: newspaper
domain: skyscraper
comment: Relation between Skyscraper and Newspaper
comment: Relazione tra Skyscraper e Newspaper @it

mountain range
label: chaîne de montagne @fr
type: Class

beverage
type: Class
label: boisson @fr

has Television Episode
type: ObjectProperty
domain: skyscraper
comment: Relazione tra Skyscraper e Television Episode @it
comment: Relation between Skyscraper and Television Episode
range: television episode

planet
label: planète @fr
type: Class

has Aircraft
comment: Relation between Skyscraper and Aircraft
type: ObjectProperty
range: aircraft
domain: skyscraper
comment: Relazione tra Skyscraper e Aircraft @it

has River
comment: Relazione tra Skyscraper e River @it
comment: Relation between Skyscraper and River
domain: skyscraper
range: river
type: ObjectProperty

has Historic Building
related match: before
range: historic building
domain: skyscraper
type: ObjectProperty
comment: Relation between Skyscraper and Historic Building
comment: Relazione tra Skyscraper e Historic Building @it

scientist
type: Class
label: Wissenschaftler @de
label: scientifique @fr

olympics
label: Jeux Olympiques @fr
type: Class

baseball league
type: Class
label: ligue de baseball @fr

has Embryology
range: embryology
comment: Relation between Skyscraper and Embryology
domain: skyscraper
type: ObjectProperty
comment: Relazione tra Skyscraper e Embryology @it

bridge
type: Class
label: pont @fr

has Mayor
range: mayor
comment: Relazione tra Skyscraper e Mayor @it
domain: skyscraper
comment: Relation between Skyscraper and Mayor
type: ObjectProperty

broadcast
label: Émission de télévision @fr
type: Class

has Power Station
range: power station
comment: Relazione tra Skyscraper e Power Station @it
type: ObjectProperty
domain: skyscraper
comment: Relation between Skyscraper and Power Station

has Green Alga
comment: Relation between Skyscraper and Green Alga
type: ObjectProperty
domain: skyscraper
comment: Relazione tra Skyscraper e Green Alga @it
range: green alga

mammal
type: Class
label: mammifère @fr

island
label: île @fr
label: νησί @el
type: Class

has Radio Station
type: ObjectProperty
comment: Relation between Skyscraper and Radio Station
domain: skyscraper
comment: Relazione tra Skyscraper e Radio Station @it
range: radio station

comics character
label: personnage de bandes dessinées @fr
type: Class

skyscraper
type: Class
label: gratte-ciel @fr

has Military Unit
type: ObjectProperty
comment: Relazione tra Skyscraper e Military Unit @it
range: military unit
domain: skyscraper
comment: Relation between Skyscraper and Military Unit

radio station
label: station de radio @fr
type: Class

member of parliament
label: membre du Parlement @fr
type: Class

has Comics Creator
comment: Relation between Skyscraper and Comics Creator
comment: Relazione tra Skyscraper e Comics Creator @it
domain: skyscraper
type: ObjectProperty
range: comics creator

conifer
label: conifères @fr
type: Class

airport
label: aéroport @fr
label: Flughafen @de
type: Class