television show
type: Class
label: émission de télévision @fr

disease
type: Class
label: maladie @fr

has Baseball League
comment: Relation between Soccer Player and Baseball League
comment: Relazione tra Soccer Player e Baseball League @it
domain: soccer player
range: baseball league
type: ObjectProperty

automobile
type: Class

colour
type: Class
label: couleur @fr
label: χρώμα @el

has Drug
comment: Relazione tra Soccer Player e Drug @it
type: ObjectProperty
domain: soccer player
range: drug
comment: Relation between Soccer Player and Drug

Election
label: élection @fr
type: Class

has Cyclist
comment: Relazione tra Soccer Player e Cyclist @it
range: cyclist
comment: Relation between Soccer Player and Cyclist
domain: soccer player
type: ObjectProperty

has Language
type: ObjectProperty
range: language
domain: soccer player
comment: Relazione tra Soccer Player e Language @it
comment: Relation between Soccer Player and Language

american football player
type: Class
label: joueur de football américain @fr

has Bird
domain: soccer player
comment: Relation between Soccer Player and Bird
comment: Relazione tra Soccer Player e Bird @it
type: ObjectProperty
range: bird

stadium
type: Class
label: stade @fr

soccer league
type: Class
label: ligue de football @fr

astronaut
label: astronaute @fr
label: Astronaut @de
type: Class

videogames league
type: Class
label: ligue de jeux vidéo @fr

has Ice Hockey League
comment: Relation between Soccer Player and Ice Hockey League
range: ice hockey league
type: ObjectProperty
domain: soccer player
comment: Relazione tra Soccer Player e Ice Hockey League @it

has Colour
domain: soccer player
comment: Relazione tra Soccer Player e Colour @it
comment: Relation between Soccer Player and Colour
type: ObjectProperty
range: colour

has Beverage
comment: Relazione tra Soccer Player e Beverage @it
domain: soccer player
type: ObjectProperty
comment: Relation between Soccer Player and Beverage
range: beverage

has Judge
domain: soccer player
comment: Relazione tra Soccer Player e Judge @it
range: judge
type: ObjectProperty
comment: Relation between Soccer Player and Judge

has Member Of Parliament
comment: Relation between Soccer Player and Member Of Parliament
domain: soccer player
comment: Relazione tra Soccer Player e Member Of Parliament @it
type: ObjectProperty
range: member of parliament

has Automobile
comment: Relation between Soccer Player and Automobile
comment: Relazione tra Soccer Player e Automobile @it
range: automobile
type: ObjectProperty
domain: soccer player

wrestler
type: Class
label: lutteur @fr

mayor
type: Class
label: maire @fr

pope
type: Class
label: pape @fr

has Wrestling Event
comment: Relation between Soccer Player and Wrestling Event
type: ObjectProperty
comment: Relazione tra Soccer Player e Wrestling Event @it
range: wrestling event
domain: soccer player

handball league
type: Class
label: ligue de handball @fr

Axiom
matching quantification: 1
annotated source: has World Heritage Site
annotated target: clubs

newspaper
label: journal @fr
type: Class

protected area
label: aire protégée @fr
label: προστατευμένη περιοχή @el
type: Class

game
type: Class
label: jeu @fr

road
label: route @fr
type: Class

has Senator
type: ObjectProperty
comment: Relazione tra Soccer Player e Senator @it
domain: soccer player
comment: Relation between Soccer Player and Senator
range: senator

has Tennis League
comment: Relation between Soccer Player and Tennis League
type: ObjectProperty
range: tennis league
comment: Relazione tra Soccer Player e Tennis League @it
domain: soccer player

has Fish
domain: soccer player
comment: Relation between Soccer Player and Fish
range: fish
type: ObjectProperty
comment: Relazione tra Soccer Player e Fish @it

boxer
type: Class
label: boxeur @fr

judge
type: Class
label: juge @fr

World Heritage Site
type: Class
label: site du patrimoine mondial @fr

has School
domain: soccer player
range: school
comment: Relation between Soccer Player and School
type: ObjectProperty
comment: Relazione tra Soccer Player e School @it
related match: youthclubs

language
type: Class
label: langage @fr

station
type: Class

Axiom
matching quantification: 39
annotated source: has School
annotated target: youthclubs

tennis league
label: ligue de tennis @fr
type: Class

has Record Label
range: record label
comment: Relation between Soccer Player and Record Label
domain: soccer player
comment: Relazione tra Soccer Player e Record Label @it
type: ObjectProperty

lake
label: lac @fr
type: Class

has Auto Racing League
comment: Relazione tra Soccer Player e Auto Racing League @it
type: ObjectProperty
comment: Relation between Soccer Player and Auto Racing League
range: auto racing league
domain: soccer player

has Christian Bishop
comment: Relation between Soccer Player and Christian Bishop
comment: Relazione tra Soccer Player e Christian Bishop @it
range: Christian Bishop
type: ObjectProperty
domain: soccer player

has Rugby League
comment: Relation between Soccer Player and Rugby League
domain: soccer player
type: ObjectProperty
comment: Relazione tra Soccer Player e Rugby League @it
range: rugby league

arachnid
label: arachnides @fr
type: Class

has Park
type: ObjectProperty
comment: Relation between Soccer Player and Park
comment: Relazione tra Soccer Player e Park @it
domain: soccer player
range: park

has Criminal
type: ObjectProperty
range: criminal
comment: Relazione tra Soccer Player e Criminal @it
comment: Relation between Soccer Player and Criminal
domain: soccer player

governor
label: gouverneur @fr
type: Class

administrative region
type: Class
label: région administrative @fr

has Cricketer
related match: after
range: cricketer
type: ObjectProperty
comment: Relation between Soccer Player and Cricketer
domain: soccer player
comment: Relazione tra Soccer Player e Cricketer @it

poker player
type: Class
label: joueur de poker @fr

river
label: rivière @fr
type: Class

has Administrative Region
related match: ci
related match: clubs
range: administrative region
type: ObjectProperty
comment: Relation between Soccer Player and Administrative Region
comment: Relazione tra Soccer Player e Administrative Region @it
domain: soccer player

lacrosse league
type: Class
label: ligue de crosse @fr

school
type: Class
label: école @fr

museum
label: musée @fr
type: Class

ship
type: Class
label: navire @fr

fish
label: poisson @fr
type: Class

tennis player
label: joueur de tennis @fr
type: Class

has Album
domain: soccer player
comment: Relazione tra Soccer Player e Album @it
type: ObjectProperty
comment: Relation between Soccer Player and Album
range: album
related match: youthclubs

video game
label: jeux vidéo @fr
type: Class

trade union
type: Class
label: syndicat professionnel @fr

has Mammal
domain: soccer player
type: ObjectProperty
comment: Relazione tra Soccer Player e Mammal @it
comment: Relation between Soccer Player and Mammal
range: mammal

has Playboy Playmate
domain: soccer player
comment: Relazione tra Soccer Player e Playboy Playmate @it
range: Playboy Playmate
type: ObjectProperty
comment: Relation between Soccer Player and Playboy Playmate

has Trade Union
related match: title
domain: soccer player
type: ObjectProperty
comment: Relation between Soccer Player and Trade Union
range: trade union
comment: Relazione tra Soccer Player e Trade Union @it

currency
label: devise @fr
type: Class

Axiom
annotated target: clubs
annotated source: has Military Unit
matching quantification: 1

British royalty
label: royauté Britannique @fr
type: Class

prime minister
label: premier ministre @fr
type: Class

has Soccer League
type: ObjectProperty
range: soccer league
domain: soccer player
comment: Relation between Soccer Player and Soccer League
comment: Relazione tra Soccer Player e Soccer League @it

historic place
label: site historique @fr
type: Class

race
type: Class
label: course @fr

hospital
type: Class
label: hôpital @fr

has Game
comment: Relation between Soccer Player and Game
type: ObjectProperty
comment: Relazione tra Soccer Player e Game @it
range: game
domain: soccer player

has Mountain Range
range: mountain range
comment: Relation between Soccer Player and Mountain Range
type: ObjectProperty
comment: Relazione tra Soccer Player e Mountain Range @it
domain: soccer player

has College
type: ObjectProperty
domain: soccer player
range: college
comment: Relation between Soccer Player and College
comment: Relazione tra Soccer Player e College @it

has Award
comment: Relazione tra Soccer Player e Award @it
domain: soccer player
comment: Relation between Soccer Player and Award
type: ObjectProperty
range: award

has Astronaut
domain: soccer player
comment: Relation between Soccer Player and Astronaut
range: astronaut
type: ObjectProperty
comment: Relazione tra Soccer Player e Astronaut @it

has Adult Actor
range: adult actor
comment: Relation between Soccer Player and Adult Actor
domain: soccer player
type: ObjectProperty
comment: Relazione tra Soccer Player e Adult Actor @it

has Magazine
type: ObjectProperty
range: magazine
comment: Relation between Soccer Player and Magazine
domain: soccer player
comment: Relazione tra Soccer Player e Magazine @it

has Radio Station
comment: Relation between Soccer Player and Radio Station
domain: soccer player
range: radio station
comment: Relazione tra Soccer Player e Radio Station @it
type: ObjectProperty

has Station
range: station
domain: soccer player
comment: Relazione tra Soccer Player e Station @it
comment: Relation between Soccer Player and Station
type: ObjectProperty

continent
label: ήπειρος @el
type: Class

has Model
comment: Relation between Soccer Player and Model
comment: Relazione tra Soccer Player e Model @it
domain: soccer player
range: model
type: ObjectProperty

has Race
domain: soccer player
range: race
comment: Relation between Soccer Player and Race
comment: Relazione tra Soccer Player e Race @it
type: ObjectProperty

album
label: Album @de
type: Class

president
type: Class
label: président @fr

figure skater
type: Class
label: patineur artistique @fr

cricket league
type: Class
label: ligue de cricket @fr

military unit
type: Class
label: unité militaire @fr

Axiom
annotated target: clubs
annotated source: has Insect
matching quantification: 1

has Lacrosse League
comment: Relation between Soccer Player and Lacrosse League
comment: Relazione tra Soccer Player e Lacrosse League @it
range: lacrosse league
type: ObjectProperty
domain: soccer player

Axiom
annotated target: after
annotated source: has Cricketer
matching quantification: 1

basketball team
type: Class

has Broadcast
comment: Relation between Soccer Player and Broadcast
range: broadcast
type: ObjectProperty
comment: Relazione tra Soccer Player e Broadcast @it
domain: soccer player

has Television Show
type: ObjectProperty
comment: Relazione tra Soccer Player e Television Show @it
domain: soccer player
comment: Relation between Soccer Player and Television Show
range: television show

has Hospital
comment: Relation between Soccer Player and Hospital
domain: soccer player
range: hospital
type: ObjectProperty
comment: Relazione tra Soccer Player e Hospital @it

music genre
type: Class
label: género musical @pt
label: genre musical @fr

Axiom
annotated source: has Trade Union
annotated target: title
matching quantification: 1

writer
label: écrivain @fr
type: Class

has Legislature
comment: Relazione tra Soccer Player e Legislature @it
domain: soccer player
type: ObjectProperty
range: legislature
comment: Relation between Soccer Player and Legislature

Axiom
matching quantification: 1
annotated target: cityofbirth
annotated source: has Island

record label
label: label discographique @fr
type: Class

architect
type: Class
label: architecte @fr

model
type: Class
label: mannequin @fr

has Conifer
comment: Relazione tra Soccer Player e Conifer @it
domain: soccer player
type: ObjectProperty
range: conifer
comment: Relation between Soccer Player and Conifer

olympic result
type: Class
label: résultat de Jeux Olympiques @fr

has American Football Player
type: ObjectProperty
comment: Relation between Soccer Player and American Football Player
comment: Relazione tra Soccer Player e American Football Player @it
domain: soccer player
range: american football player

has Monarch
range: monarch
type: ObjectProperty
domain: soccer player
comment: Relation between Soccer Player and Monarch
comment: Relazione tra Soccer Player e Monarch @it

has Videogames League
comment: Relation between Soccer Player and Videogames League
type: ObjectProperty
comment: Relazione tra Soccer Player e Videogames League @it
range: videogames league
domain: soccer player

has Ship
type: ObjectProperty
comment: Relation between Soccer Player and Ship
range: ship
comment: Relazione tra Soccer Player e Ship @it
domain: soccer player

Axiom
annotated source: has University
annotated target: clubs
matching quantification: 38

Axiom
matching quantification: 6
annotated target: teams
annotated source: has American Football Team

has Music Festival
domain: soccer player
comment: Relation between Soccer Player and Music Festival
range: music festival
type: ObjectProperty
comment: Relazione tra Soccer Player e Music Festival @it

has Bridge
type: ObjectProperty
comment: Relazione tra Soccer Player e Bridge @it
comment: Relation between Soccer Player and Bridge
domain: soccer player
range: bridge

has Writer
related match: clubs
domain: soccer player
comment: Relation between Soccer Player and Writer
type: ObjectProperty
range: writer
comment: Relazione tra Soccer Player e Writer @it

comics creator
label: créateur de bandes dessinées @fr
type: Class

aircraft
label: avion @fr
type: Class
label: αεροσκάφος @el

has Artery
domain: soccer player
comment: Relation between Soccer Player and Artery
comment: Relazione tra Soccer Player e Artery @it
type: ObjectProperty
range: artery

Axiom
annotated source: has Military Unit
matching quantification: 1
annotated target: youthclubs

has Island
related match: cityofbirth
comment: Relation between Soccer Player and Island
comment: Relazione tra Soccer Player e Island @it
range: island
type: ObjectProperty
domain: soccer player

has Olympics
type: ObjectProperty
domain: soccer player
comment: Relation between Soccer Player and Olympics
comment: Relazione tra Soccer Player e Olympics @it
range: olympics

hockey team
type: Class
label: équipe de hockey @fr

soccer player
type: Class
label: joueur de football @fr

has Canal
type: ObjectProperty
comment: Relation between Soccer Player and Canal
comment: Relazione tra Soccer Player e Canal @it
domain: soccer player
range: canal

reptile
type: Class

legislature
type: Class
label: pouvoir législatif @fr

Axiom
matching quantification: 1
annotated source: has Military Person
annotated target: clubs

airline
type: Class
label: compagnie aérienne @fr

has Olympic Result
comment: Relazione tra Soccer Player e Olympic Result @it
type: ObjectProperty
domain: soccer player
comment: Relation between Soccer Player and Olympic Result
range: olympic result

has River
comment: Relazione tra Soccer Player e River @it
type: ObjectProperty
comment: Relation between Soccer Player and River
domain: soccer player
range: river

monarch
type: Class
label: monarque @fr

has Military Unit
comment: Relation between Soccer Player and Military Unit
range: military unit
domain: soccer player
comment: Relazione tra Soccer Player e Military Unit @it
type: ObjectProperty
related match: youthclubs
related match: caps
related match: clubs

congressman
type: Class
label: membre du Congrès @fr

golf player
type: Class
label: golfeur @fr

has Poker Player
type: ObjectProperty
range: poker player
domain: soccer player
comment: Relation between Soccer Player and Poker Player
comment: Relazione tra Soccer Player e Poker Player @it

nascar driver
type: Class
label: pilote de la nascar @fr

journalist
type: Class
label: journaliste @fr

Axiom
matching quantification: 1
annotated source: has Town
annotated target: youthclubs

has Music Genre
domain: soccer player
type: ObjectProperty
comment: Relazione tra Soccer Player e Music Genre @it
comment: Relation between Soccer Player and Music Genre
range: music genre

has Pope
comment: Relation between Soccer Player and Pope
range: pope
type: ObjectProperty
domain: soccer player
comment: Relazione tra Soccer Player e Pope @it

insect
label: insecte @fr
type: Class

film
label: ταινία @el
type: Class

american football team
type: Class
label: équipe américaine de football américain @fr

has Basketball Player
comment: Relation between Soccer Player and Basketball Player
comment: Relazione tra Soccer Player e Basketball Player @it
domain: soccer player
range: basketball player
type: ObjectProperty

has Non- Profit Organisation
domain: soccer player
range: non-profit organisation
comment: Relazione tra Soccer Player e Non- Profit Organisation @it
comment: Relation between Soccer Player and Non- Profit Organisation
type: ObjectProperty

has Baseball Player
comment: Relazione tra Soccer Player e Baseball Player @it
type: ObjectProperty
comment: Relation between Soccer Player and Baseball Player
range: baseball player
domain: soccer player

Axiom
matching quantification: 1
annotated source: has Grape
annotated target: clubs

chemical compound
type: Class
label: produit chimique @fr

bird
label: oiseau @fr
type: Class

has Governor
range: governor
type: ObjectProperty
comment: Relation between Soccer Player and Governor
comment: Relazione tra Soccer Player e Governor @it
domain: soccer player

power station
type: Class

Gaelic games player
label: joueur de sports gaéliques @fr
type: Class

has Gaelic Games Player
type: ObjectProperty
comment: Relation between Soccer Player and Gaelic Games Player
comment: Relazione tra Soccer Player e Gaelic Games Player @it
range: Gaelic games player
domain: soccer player

musical artist
label: musicien @fr
type: Class
label: artista musical @pt

has Architect
type: ObjectProperty
comment: Relazione tra Soccer Player e Architect @it
domain: soccer player
range: architect
comment: Relation between Soccer Player and Architect

has Basketball League
comment: Relazione tra Soccer Player e Basketball League @it
range: basketball league
type: ObjectProperty
comment: Relation between Soccer Player and Basketball League
domain: soccer player

has Golf Player
comment: Relation between Soccer Player and Golf Player
type: ObjectProperty
domain: soccer player
range: golf player
comment: Relazione tra Soccer Player e Golf Player @it

has Power Station
comment: Relazione tra Soccer Player e Power Station @it
comment: Relation between Soccer Player and Power Station
domain: soccer player
type: ObjectProperty
range: power station

has Hotel
comment: Relation between Soccer Player and Hotel
comment: Relazione tra Soccer Player e Hotel @it
type: ObjectProperty
range: hotel
domain: soccer player

Axiom
annotated target: after
matching quantification: 1
annotated source: has College Coach

park
type: Class
label: parc @fr

has Cricket League
domain: soccer player
comment: Relazione tra Soccer Player e Cricket League @it
range: cricket league
type: ObjectProperty
comment: Relation between Soccer Player and Cricket League

rugby player
type: Class
label: joueur de rugby @fr

has Airport
domain: soccer player
comment: Relation between Soccer Player and Airport
comment: Relazione tra Soccer Player e Airport @it
range: airport
type: ObjectProperty

american football league
type: Class

has Musical Artist
type: ObjectProperty
domain: soccer player
comment: Relation between Soccer Player and Musical Artist
range: musical artist
comment: Relazione tra Soccer Player e Musical Artist @it

has Basketball Team
comment: Relation between Soccer Player and Basketball Team
range: basketball team
domain: soccer player
comment: Relazione tra Soccer Player e Basketball Team @it
type: ObjectProperty

has Reptile
type: ObjectProperty
domain: soccer player
range: reptile
comment: Relazione tra Soccer Player e Reptile @it
comment: Relation between Soccer Player and Reptile

has Mayor
comment: Relazione tra Soccer Player e Mayor @it
comment: Relation between Soccer Player and Mayor
type: ObjectProperty
domain: soccer player
range: mayor

has Office Holder
related match: after
range: office holder
type: ObjectProperty
comment: Relazione tra Soccer Player e Office Holder @it
comment: Relation between Soccer Player and Office Holder
domain: soccer player

has Restaurant
comment: Relazione tra Soccer Player e Restaurant @it
comment: Relation between Soccer Player and Restaurant
type: ObjectProperty
domain: soccer player
range: restaurant

has Saint
comment: Relation between Soccer Player and Saint
domain: soccer player
comment: Relazione tra Soccer Player e Saint @it
range: saint
type: ObjectProperty

Ontology
extracted from: dbpedia.org
comment: SoccerPlayer Encyclopedic Knowledge Pattern
extracted from: en.wikipedia.org
imports: cpannotationschema.owl
has author: Aldo Gangemi
has author: Valentina Presutti
has intent: To represent the encyclopedic knowledge expressed by an object typed as SoccerPlayer
has author: Andrea Giovanni Nuzzolese

has Tennis Player
domain: soccer player
range: tennis player
comment: Relation between Soccer Player and Tennis Player
comment: Relazione tra Soccer Player e Tennis Player @it
type: ObjectProperty

cyclist
label: cycliste @fr
type: Class

has Comics Creator
domain: soccer player
type: ObjectProperty
range: comics creator
comment: Relation between Soccer Player and Comics Creator
comment: Relazione tra Soccer Player e Comics Creator @it

has Convention
type: ObjectProperty
comment: Relazione tra Soccer Player e Convention @it
comment: Relation between Soccer Player and Convention
domain: soccer player
range: convention

national collegiate athletic association athlete
type: Class
label: athlète de la national collegiate athletic association @fr

has Lake
range: lake
type: ObjectProperty
domain: soccer player
comment: Relazione tra Soccer Player e Lake @it
comment: Relation between Soccer Player and Lake

has Bacteria
comment: Relation between Soccer Player and Bacteria
comment: Relazione tra Soccer Player e Bacteria @it
range: bacteria
domain: soccer player
type: ObjectProperty

wrestling event
type: Class
label: match de catch @fr

Axiom
annotated target: cityofbirth
annotated source: has Town
matching quantification: 8

has Disease
comment: Relazione tra Soccer Player e Disease @it
type: ObjectProperty
range: disease
comment: Relation between Soccer Player and Disease
domain: soccer player

has Skyscraper
comment: Relazione tra Soccer Player e Skyscraper @it
domain: soccer player
comment: Relation between Soccer Player and Skyscraper
range: skyscraper
type: ObjectProperty

has Mountain
type: ObjectProperty
comment: Relazione tra Soccer Player e Mountain @it
domain: soccer player
comment: Relation between Soccer Player and Mountain
range: mountain

basketball league
label: ligue de basketball @fr
type: Class

mountain
label: Βουνό @el
label: montagne @fr
type: Class

criminal
label: criminel @fr
type: Class

has Military Conflict
type: ObjectProperty
comment: Relation between Soccer Player and Military Conflict
domain: soccer player
range: military conflict
comment: Relazione tra Soccer Player e Military Conflict @it

has Website
comment: Relazione tra Soccer Player e Website @it
type: ObjectProperty
range: website
domain: soccer player
comment: Relation between Soccer Player and Website

senator
label: sénateur @fr
type: Class

has Arachnid
comment: Relazione tra Soccer Player e Arachnid @it
range: arachnid
type: ObjectProperty
domain: soccer player
comment: Relation between Soccer Player and Arachnid

saint
type: Class

comedian
type: Class
label: comédien @fr

has Handball League
domain: soccer player
comment: Relazione tra Soccer Player e Handball League @it
comment: Relation between Soccer Player and Handball League
type: ObjectProperty
range: handball league

song
label: chanson @fr
type: Class

has Golf League
range: golf league
comment: Relation between Soccer Player and Golf League
type: ObjectProperty
comment: Relazione tra Soccer Player e Golf League @it
domain: soccer player

Playboy Playmate
type: Class
label: playmate pour Playboy @fr

convention
label: congrès @fr
type: Class

book
label: llibre @ca
label: książka @pl
label: βιβλίο @el
label: livre @fr
type: Class

has British Royalty
type: ObjectProperty
domain: soccer player
range: British royalty
comment: Relazione tra Soccer Player e British Royalty @it
comment: Relation between Soccer Player and British Royalty

has Badminton Player
domain: soccer player
range: badminton player
comment: Relation between Soccer Player and Badminton Player
type: ObjectProperty
comment: Relazione tra Soccer Player e Badminton Player @it

Axiom
annotated source: has Office Holder
annotated target: after
matching quantification: 1

shopping mall
label: centre commercial @fr
type: Class

has Formula One Racer
type: ObjectProperty
domain: soccer player
comment: Relazione tra Soccer Player e Formula One Racer @it
comment: Relation between Soccer Player and Formula One Racer
range: Formula One racer

has National Collegiate Athletic Association Athlete
domain: soccer player
type: ObjectProperty
range: national collegiate athletic association athlete
comment: Relazione tra Soccer Player e National Collegiate Athletic Association Athlete @it
comment: Relation between Soccer Player and National Collegiate Athletic Association Athlete

has Planet
range: planet
domain: soccer player
comment: Relation between Soccer Player and Planet
type: ObjectProperty
comment: Relazione tra Soccer Player e Planet @it

has World Heritage Site
domain: soccer player
comment: Relazione tra Soccer Player e World Heritage Site @it
type: ObjectProperty
comment: Relation between Soccer Player and World Heritage Site
range: World Heritage Site
related match: clubs
related match: youthclubs

bacteria
label: bactérie @fr
type: Class

ski area
type: Class
label: domaine skiable @fr

Axiom
annotated source: has University
annotated target: youthclubs
matching quantification: 73

non-profit organisation
type: Class
label: organisation à but non lucratif @fr

has College Coach
related match: after
comment: Relation between Soccer Player and College Coach
comment: Relazione tra Soccer Player e College Coach @it
range: college coach
domain: soccer player
type: ObjectProperty

has Stadium
related match: st
comment: Relation between Soccer Player and Stadium
domain: soccer player
comment: Relazione tra Soccer Player e Stadium @it
range: stadium
type: ObjectProperty

has Band
domain: soccer player
type: ObjectProperty
comment: Relation between Soccer Player and Band
range: Band
comment: Relazione tra Soccer Player e Band @it

has Election
range: Election
comment: Relazione tra Soccer Player e Election @it
type: ObjectProperty
comment: Relation between Soccer Player and Election
domain: soccer player

rugby league
type: Class
label: ligue de rugby @fr

has Newspaper
comment: Relation between Soccer Player and Newspaper
range: newspaper
type: ObjectProperty
comment: Relazione tra Soccer Player e Newspaper @it
domain: soccer player

weapon
label: arme @fr
type: Class

drug
label: médicament @fr
type: Class

has Airline
type: ObjectProperty
comment: Relazione tra Soccer Player e Airline @it
range: airline
domain: soccer player
comment: Relation between Soccer Player and Airline
related match: clubs

has Comics Character
comment: Relation between Soccer Player and Comics Character
domain: soccer player
range: comics character
comment: Relazione tra Soccer Player e Comics Character @it
type: ObjectProperty

magazine
label: περιοδικό @el
type: Class

has Single
range: single
comment: Relazione tra Soccer Player e Single @it
comment: Relation between Soccer Player and Single
type: ObjectProperty
domain: soccer player

Axiom
annotated source: has Administrative Region
annotated target: ci
matching quantification: 1

has Weapon
domain: soccer player
type: ObjectProperty
comment: Relazione tra Soccer Player e Weapon @it
range: weapon
comment: Relation between Soccer Player and Weapon

has Scientist
type: ObjectProperty
comment: Relazione tra Soccer Player e Scientist @it
comment: Relation between Soccer Player and Scientist
range: scientist
domain: soccer player

canal
type: Class

has Rugby Player
range: rugby player
comment: Relation between Soccer Player and Rugby Player
comment: Relazione tra Soccer Player e Rugby Player @it
type: ObjectProperty
domain: soccer player

military person
type: Class
label: militaire @fr

philosopher
label: philosophe @fr
type: Class

award
label: récompense @fr
type: Class

has Book
comment: Relazione tra Soccer Player e Book @it
type: ObjectProperty
range: book
domain: soccer player
comment: Relation between Soccer Player and Book

Axiom
annotated source: has Airline
matching quantification: 1
annotated target: clubs

college
type: Class

has University
comment: Relazione tra Soccer Player e University @it
type: ObjectProperty
domain: soccer player
comment: Relation between Soccer Player and University
range: university
related match: youthclubs
related match: clubs

has Currency
type: ObjectProperty
comment: Relation between Soccer Player and Currency
comment: Relazione tra Soccer Player e Currency @it
domain: soccer player
range: currency

has Chemical Compound
domain: soccer player
comment: Relazione tra Soccer Player e Chemical Compound @it
comment: Relation between Soccer Player and Chemical Compound
range: chemical compound
type: ObjectProperty

has Muscle
domain: soccer player
comment: Relation between Soccer Player and Muscle
range: muscle
type: ObjectProperty
comment: Relazione tra Soccer Player e Muscle @it

restaurant
type: Class

cricketer
label: joueur de cricket @fr
type: Class

has Museum
range: museum
comment: Relazione tra Soccer Player e Museum @it
domain: soccer player
comment: Relation between Soccer Player and Museum
type: ObjectProperty

single
type: Class

has Film
comment: Relazione tra Soccer Player e Film @it
type: ObjectProperty
domain: soccer player
comment: Relation between Soccer Player and Film
range: film

Band
label: banda @pt
label: Musikgruppe @de
type: Class
label: groupe de musique @fr

town
type: Class
label: ville @fr

university
label: πανεπιστήμιο @el
label: université @fr
type: Class

has American Football Team
related match: teams
type: ObjectProperty
domain: soccer player
range: american football team
comment: Relation between Soccer Player and American Football Team
comment: Relazione tra Soccer Player e American Football Team @it

auto racing league
label: la ligue de course automobile @fr
type: Class

has Ski Area
range: ski area
comment: Relation between Soccer Player and Ski Area
type: ObjectProperty
domain: soccer player
comment: Relazione tra Soccer Player e Ski Area @it

has President
range: president
domain: soccer player
type: ObjectProperty
comment: Relation between Soccer Player and President
comment: Relazione tra Soccer Player e President @it

ethnic group
type: Class
label: groupe ethnique @fr

has Historic Place
range: historic place
domain: soccer player
comment: Relation between Soccer Player and Historic Place
comment: Relazione tra Soccer Player e Historic Place @it
type: ObjectProperty

has Nascar Driver
comment: Relation between Soccer Player and Nascar Driver
domain: soccer player
type: ObjectProperty
comment: Relazione tra Soccer Player e Nascar Driver @it
range: nascar driver

has Military Person
range: military person
comment: Relazione tra Soccer Player e Military Person @it
comment: Relation between Soccer Player and Military Person
type: ObjectProperty
domain: soccer player
related match: clubs

has Journalist
comment: Relazione tra Soccer Player e Journalist @it
type: ObjectProperty
range: journalist
domain: soccer player
comment: Relation between Soccer Player and Journalist

artery
label: Arterie @de
type: Class
label: artère @fr

Axiom
annotated source: has Town
matching quantification: 5
annotated target: clubs

has Historic Building
comment: Relation between Soccer Player and Historic Building
domain: soccer player
comment: Relazione tra Soccer Player e Historic Building @it
type: ObjectProperty
range: historic building

hotel
type: Class
label: hôtel @fr

music festival
type: Class
label: festival de musique @fr

field hockey league
type: Class
label: ligue d'hockey sur gazon @fr

Axiom
annotated target: clubs
annotated source: has Writer
matching quantification: 1

college coach
label: entraîneur universitaire @fr
type: Class

television episode
label: épisode télévisé @fr
type: Class

muscle
type: Class

village
type: Class
label: χωριό @el

has Grape
related match: clubs
type: ObjectProperty
comment: Relazione tra Soccer Player e Grape @it
comment: Relation between Soccer Player and Grape
range: grape
domain: soccer player

ice hockey league
label: ligue d'hockey sur glace @fr
type: Class

historic building
type: Class
label: bâtiment historique @fr

office holder
type: Class
label: Amtsinhaber @de
label: titulaire @fr

baseball player
type: Class
label: joueur de baseball @fr

has Video Game
comment: Relazione tra Soccer Player e Video Game @it
range: video game
comment: Relation between Soccer Player and Video Game
domain: soccer player
type: ObjectProperty

military conflict
type: Class
label: conflit militaire @fr

grape
type: Class
label: raisin @fr

website
label: Ιστότοπος @el
label: site web @fr
type: Class

Axiom
annotated source: has Town
annotated target: ci
matching quantification: 2

has Bone
comment: Relazione tra Soccer Player e Bone @it
type: ObjectProperty
domain: soccer player
range: bone
comment: Relation between Soccer Player and Bone

basketball player
type: Class
label: joueur de basketball @fr

Axiom
annotated source: has Album
annotated target: youthclubs
matching quantification: 1

Axiom
annotated source: has Military Unit
matching quantification: 1
annotated target: caps

adult actor
label: acteur adulte @fr
type: Class
label: erwachsener Schauspieler @de

has Insect
related match: clubs
range: insect
type: ObjectProperty
comment: Relazione tra Soccer Player e Insect @it
comment: Relation between Soccer Player and Insect
domain: soccer player

Axiom
matching quantification: 1
annotated source: has Town
annotated target: placeOfBirth

ice hockey player
type: Class
label: joueur de hockey sur glace @fr

has Ice Hockey Player
type: ObjectProperty
comment: Relazione tra Soccer Player e Ice Hockey Player @it
domain: soccer player
range: ice hockey player
comment: Relation between Soccer Player and Ice Hockey Player

has American Football League
comment: Relazione tra Soccer Player e American Football League @it
type: ObjectProperty
range: american football league
comment: Relation between Soccer Player and American Football League
domain: soccer player

Christian Bishop
label: évêque chrétien @fr
type: Class

mountain range
type: Class
label: chaîne de montagne @fr

beverage
label: boisson @fr
type: Class

has Song
comment: Relation between Soccer Player and Song
domain: soccer player
comment: Relazione tra Soccer Player e Song @it
range: song
type: ObjectProperty

planet
label: planète @fr
type: Class

Axiom
annotated target: clubs
annotated source: has Village
matching quantification: 1

has Philosopher
range: philosopher
type: ObjectProperty
domain: soccer player
comment: Relation between Soccer Player and Philosopher
comment: Relazione tra Soccer Player e Philosopher @it

has Road
comment: Relazione tra Soccer Player e Road @it
type: ObjectProperty
comment: Relation between Soccer Player and Road
domain: soccer player
range: road

has Village
related match: clubs
domain: soccer player
comment: Relation between Soccer Player and Village
type: ObjectProperty
comment: Relazione tra Soccer Player e Village @it
range: village

scientist
label: Wissenschaftler @de
type: Class
label: scientifique @fr

has Figure Skater
comment: Relation between Soccer Player and Figure Skater
range: figure skater
domain: soccer player
type: ObjectProperty
comment: Relazione tra Soccer Player e Figure Skater @it

golf league
label: ligue de golf @fr
type: Class

has Ethnic Group
comment: Relation between Soccer Player and Ethnic Group
type: ObjectProperty
comment: Relazione tra Soccer Player e Ethnic Group @it
range: ethnic group
domain: soccer player

Axiom
annotated target: clubs
annotated source: has Administrative Region
matching quantification: 20

olympics
type: Class
label: Jeux Olympiques @fr

badminton player
label: joueur de badminton @fr
type: Class

has Wrestler
domain: soccer player
comment: Relation between Soccer Player and Wrestler
range: wrestler
type: ObjectProperty
comment: Relazione tra Soccer Player e Wrestler @it

baseball league
type: Class
label: ligue de baseball @fr

bridge
label: pont @fr
type: Class

has Hockey Team
range: hockey team
domain: soccer player
comment: Relation between Soccer Player and Hockey Team
type: ObjectProperty
comment: Relazione tra Soccer Player e Hockey Team @it

has Shopping Mall
type: ObjectProperty
domain: soccer player
range: shopping mall
comment: Relation between Soccer Player and Shopping Mall
comment: Relazione tra Soccer Player e Shopping Mall @it

broadcast
type: Class
label: Émission de télévision @fr

has Boxer
comment: Relation between Soccer Player and Boxer
comment: Relazione tra Soccer Player e Boxer @it
range: boxer
type: ObjectProperty
domain: soccer player

mammal
type: Class
label: mammifère @fr

Axiom
annotated target: youthclubs
matching quantification: 1
annotated source: has World Heritage Site

island
label: île @fr
label: νησί @el
type: Class

has Continent
range: continent
comment: Relazione tra Soccer Player e Continent @it
domain: soccer player
type: ObjectProperty
comment: Relation between Soccer Player and Continent

has Field Hockey League
comment: Relation between Soccer Player and Field Hockey League
range: field hockey league
comment: Relazione tra Soccer Player e Field Hockey League @it
domain: soccer player
type: ObjectProperty

has Comedian
type: ObjectProperty
domain: soccer player
range: comedian
comment: Relation between Soccer Player and Comedian
comment: Relazione tra Soccer Player e Comedian @it

comics character
type: Class
label: personnage de bandes dessinées @fr

has Protected Area
range: protected area
comment: Relazione tra Soccer Player e Protected Area @it
comment: Relation between Soccer Player and Protected Area
domain: soccer player
type: ObjectProperty

has Prime Minister
comment: Relation between Soccer Player and Prime Minister
domain: soccer player
comment: Relazione tra Soccer Player e Prime Minister @it
type: ObjectProperty
range: prime minister

Formula One racer
type: Class
label: pilote de formule 1 @fr

skyscraper
type: Class
label: gratte-ciel @fr

Axiom
matching quantification: 18
annotated target: st
annotated source: has Stadium

has Aircraft
domain: soccer player
comment: Relazione tra Soccer Player e Aircraft @it
comment: Relation between Soccer Player and Aircraft
range: aircraft
type: ObjectProperty

has Town
comment: Relation between Soccer Player and Town
range: town
domain: soccer player
comment: Relazione tra Soccer Player e Town @it
related match: clubs
related match: cityofbirth
related match: ci
related match: placeOfBirth
related match: youthclubs
type: ObjectProperty

radio station
label: station de radio @fr
type: Class

has Television Episode
range: television episode
type: ObjectProperty
domain: soccer player
comment: Relazione tra Soccer Player e Television Episode @it
comment: Relation between Soccer Player and Television Episode

member of parliament
type: Class
label: membre du Parlement @fr

bone
type: Class
label: Knochen @de
label: os @fr

conifer
type: Class
label: conifères @fr

airport
type: Class
label: Flughafen @de
label: aéroport @fr

has Congressman
comment: Relation between Soccer Player and Congressman
comment: Relazione tra Soccer Player e Congressman @it
domain: soccer player
type: ObjectProperty
range: congressman