has Nascar Driver
range: nascar driver
type: ObjectProperty
comment: Relation between Space Mission and Nascar Driver
domain: space mission
comment: Relazione tra Space Mission e Nascar Driver @it

has Mammal
range: mammal
comment: Relation between Space Mission and Mammal
comment: Relazione tra Space Mission e Mammal @it
domain: space mission
type: ObjectProperty

has Lake
domain: space mission
range: lake
type: ObjectProperty
comment: Relazione tra Space Mission e Lake @it
comment: Relation between Space Mission and Lake

television show
label: émission de télévision @fr
type: Class

fictional character
type: Class
label: personnage de fiction @fr

has Basketball Player
range: basketball player
comment: Relation between Space Mission and Basketball Player
domain: space mission
type: ObjectProperty
comment: Relazione tra Space Mission e Basketball Player @it

disease
label: maladie @fr
type: Class

has Video Game
comment: Relazione tra Space Mission e Video Game @it
type: ObjectProperty
range: video game
domain: space mission
comment: Relation between Space Mission and Video Game

has Baseball Player
range: baseball player
comment: Relation between Space Mission and Baseball Player
comment: Relazione tra Space Mission e Baseball Player @it
type: ObjectProperty
domain: space mission

has World Heritage Site
range: World Heritage Site
domain: space mission
type: ObjectProperty
comment: Relation between Space Mission and World Heritage Site
comment: Relazione tra Space Mission e World Heritage Site @it

american football league
type: Class

spacecraft
type: Class
label: vaisseau spatial @fr

colour
type: Class
label: couleur @fr
label: χρώμα @el

automobile
type: Class

has Newspaper
range: newspaper
type: ObjectProperty
comment: Relazione tra Space Mission e Newspaper @it
comment: Relation between Space Mission and Newspaper
domain: space mission

has Protein
domain: space mission
range: protein
comment: Relazione tra Space Mission e Protein @it
comment: Relation between Space Mission and Protein
type: ObjectProperty

Election
type: Class
label: élection @fr

musical
label: musique @fr
type: Class

has Fungus
domain: space mission
comment: Relation between Space Mission and Fungus
type: ObjectProperty
range: fungus
comment: Relazione tra Space Mission e Fungus @it

has Soccer Player
comment: Relation between Space Mission and Soccer Player
domain: space mission
range: soccer player
comment: Relazione tra Space Mission e Soccer Player @it
type: ObjectProperty

year in spaceflight
label: année de vols spatiaux @fr
type: Class

actor
label: Schauspieler @de
type: Class
label: acteur @fr

american football player
type: Class
label: joueur de football américain @fr

cyclist
type: Class
label: cycliste @fr

has Basketball Team
comment: Relazione tra Space Mission e Basketball Team @it
type: ObjectProperty
domain: space mission
range: basketball team
comment: Relation between Space Mission and Basketball Team

has Crustacean
type: ObjectProperty
range: crustacean
domain: space mission
comment: Relazione tra Space Mission e Crustacean @it
comment: Relation between Space Mission and Crustacean

has Music Genre
comment: Relazione tra Space Mission e Music Genre @it
range: music genre
type: ObjectProperty
comment: Relation between Space Mission and Music Genre
domain: space mission

has British Royalty
range: British royalty
domain: space mission
type: ObjectProperty
comment: Relation between Space Mission and British Royalty
comment: Relazione tra Space Mission e British Royalty @it

has Bird
comment: Relazione tra Space Mission e Bird @it
range: bird
comment: Relation between Space Mission and Bird
type: ObjectProperty
domain: space mission

has College Coach
range: college coach
type: ObjectProperty
comment: Relazione tra Space Mission e College Coach @it
domain: space mission
comment: Relation between Space Mission and College Coach

mountain
type: Class
label: montagne @fr
label: Βουνό @el

has Poker Player
domain: space mission
type: ObjectProperty
range: poker player
comment: Relazione tra Space Mission e Poker Player @it
comment: Relation between Space Mission and Poker Player

amphibian
type: Class
label: amphibien @fr

flowering plant
type: Class
label: angiospermes @fr

senator
type: Class
label: sénateur @fr

has Continent
range: continent
comment: Relazione tra Space Mission e Continent @it
domain: space mission
comment: Relation between Space Mission and Continent
type: ObjectProperty

comedian
label: comédien @fr
type: Class

has Fictional Character
range: fictional character
type: ObjectProperty
comment: Relation between Space Mission and Fictional Character
comment: Relazione tra Space Mission e Fictional Character @it
domain: space mission

has Comedian
range: comedian
comment: Relazione tra Space Mission e Comedian @it
type: ObjectProperty
domain: space mission
comment: Relation between Space Mission and Comedian

has Amphibian
type: ObjectProperty
comment: Relazione tra Space Mission e Amphibian @it
comment: Relation between Space Mission and Amphibian
range: amphibian
domain: space mission

has Olympics
domain: space mission
comment: Relation between Space Mission and Olympics
comment: Relazione tra Space Mission e Olympics @it
type: ObjectProperty
range: olympics

has Island
type: ObjectProperty
domain: space mission
range: island
comment: Relazione tra Space Mission e Island @it
comment: Relation between Space Mission and Island

has Aircraft
comment: Relazione tra Space Mission e Aircraft @it
domain: space mission
range: aircraft
type: ObjectProperty
comment: Relation between Space Mission and Aircraft

has Musical
comment: Relazione tra Space Mission e Musical @it
type: ObjectProperty
range: musical
domain: space mission
comment: Relation between Space Mission and Musical

song
label: chanson @fr
type: Class

newspaper
type: Class
label: journal @fr

protected area
label: aire protégée @fr
label: προστατευμένη περιοχή @el
type: Class

book
label: książka @pl
label: livre @fr
type: Class
label: llibre @ca
label: βιβλίο @el

has Chemical Compound
comment: Relation between Space Mission and Chemical Compound
type: ObjectProperty
range: chemical compound
domain: space mission
comment: Relazione tra Space Mission e Chemical Compound @it

has President
comment: Relation between Space Mission and President
type: ObjectProperty
domain: space mission
comment: Relazione tra Space Mission e President @it
range: president

World Heritage Site
type: Class
label: site du patrimoine mondial @fr

has Senator
type: ObjectProperty
range: senator
domain: space mission
comment: Relazione tra Space Mission e Senator @it
comment: Relation between Space Mission and Senator

has Automobile
range: automobile
domain: space mission
comment: Relation between Space Mission and Automobile
comment: Relazione tra Space Mission e Automobile @it
type: ObjectProperty

has Award
domain: space mission
comment: Relazione tra Space Mission e Award @it
range: award
type: ObjectProperty
comment: Relation between Space Mission and Award

language
label: langage @fr
type: Class

bacteria
label: bactérie @fr
type: Class

has Scientist
range: scientist
comment: Relation between Space Mission and Scientist
type: ObjectProperty
comment: Relazione tra Space Mission e Scientist @it
domain: space mission

has Website
domain: space mission
comment: Relazione tra Space Mission e Website @it
type: ObjectProperty
range: website
comment: Relation between Space Mission and Website

has American Football Player
type: ObjectProperty
range: american football player
domain: space mission
comment: Relazione tra Space Mission e American Football Player @it
comment: Relation between Space Mission and American Football Player

Ontology
comment: SpaceMission Encyclopedic Knowledge Pattern
has intent: To represent the encyclopedic knowledge expressed by an object typed as SpaceMission
extracted from: dbpedia.org
imports: cpannotationschema.owl
has author: Valentina Presutti
has author: Aldo Gangemi
extracted from: en.wikipedia.org
has author: Andrea Giovanni Nuzzolese

has Conifer
comment: Relation between Space Mission and Conifer
type: ObjectProperty
comment: Relazione tra Space Mission e Conifer @it
range: conifer
domain: space mission

lake
type: Class
label: lac @fr

has Spacecraft
range: spacecraft
type: ObjectProperty
domain: space mission
comment: Relation between Space Mission and Spacecraft
comment: Relazione tra Space Mission e Spacecraft @it

has Museum
domain: space mission
type: ObjectProperty
range: museum
comment: Relazione tra Space Mission e Museum @it
comment: Relation between Space Mission and Museum

has Legislature
domain: space mission
type: ObjectProperty
comment: Relation between Space Mission and Legislature
comment: Relazione tra Space Mission e Legislature @it
range: legislature

has Insect
comment: Relazione tra Space Mission e Insect @it
type: ObjectProperty
comment: Relation between Space Mission and Insect
range: insect
domain: space mission

has Ship
domain: space mission
range: ship
comment: Relazione tra Space Mission e Ship @it
type: ObjectProperty
comment: Relation between Space Mission and Ship

has Fern
comment: Relazione tra Space Mission e Fern @it
comment: Relation between Space Mission and Fern
domain: space mission
type: ObjectProperty
range: fern

governor
label: gouverneur @fr
type: Class

drug
type: Class
label: médicament @fr

has Actor
comment: Relazione tra Space Mission e Actor @it
domain: space mission
comment: Relation between Space Mission and Actor
range: actor
type: ObjectProperty

poker player
label: joueur de poker @fr
type: Class

river
label: rivière @fr
type: Class

has Song
type: ObjectProperty
comment: Relation between Space Mission and Song
range: song
domain: space mission
comment: Relazione tra Space Mission e Song @it

has Currency
comment: Relation between Space Mission and Currency
type: ObjectProperty
domain: space mission
range: currency
comment: Relazione tra Space Mission e Currency @it

has Anatomical Structure
range: anatomical structure
comment: Relazione tra Space Mission e Anatomical Structure @it
comment: Relation between Space Mission and Anatomical Structure
type: ObjectProperty
domain: space mission

magazine
label: περιοδικό @el
type: Class

has Broadcast
comment: Relazione tra Space Mission e Broadcast @it
domain: space mission
range: broadcast
type: ObjectProperty
comment: Relation between Space Mission and Broadcast

has Airline
domain: space mission
comment: Relazione tra Space Mission e Airline @it
comment: Relation between Space Mission and Airline
type: ObjectProperty
range: airline

school
label: école @fr
type: Class

ship
label: navire @fr
type: Class

museum
type: Class
label: musée @fr

fish
type: Class
label: poisson @fr

has Cyclist
comment: Relazione tra Space Mission e Cyclist @it
type: ObjectProperty
comment: Relation between Space Mission and Cyclist
range: cyclist
domain: space mission

video game
type: Class
label: jeux vidéo @fr

has American Football League
range: american football league
type: ObjectProperty
comment: Relazione tra Space Mission e American Football League @it
comment: Relation between Space Mission and American Football League
domain: space mission

has Sport
comment: Relazione tra Space Mission e Sport @it
type: ObjectProperty
range: sport
domain: space mission
comment: Relation between Space Mission and Sport

has Language
type: ObjectProperty
domain: space mission
comment: Relazione tra Space Mission e Language @it
range: language
comment: Relation between Space Mission and Language

military person
type: Class
label: militaire @fr

currency
label: devise @fr
type: Class

award
type: Class
label: récompense @fr

prime minister
label: premier ministre @fr
type: Class

British royalty
label: royauté Britannique @fr
type: Class

has University
range: university
comment: Relazione tra Space Mission e University @it
comment: Relation between Space Mission and University
domain: space mission
type: ObjectProperty

anatomical structure
type: Class
label: structure anatomique @fr

monument
type: Class

sport
type: Class

has Monument
comment: Relazione tra Space Mission e Monument @it
range: monument
type: ObjectProperty
domain: space mission
comment: Relation between Space Mission and Monument

cricketer
label: joueur de cricket @fr
type: Class

lunar crater
type: Class
label: cratère lunaire @fr

has Magazine
type: ObjectProperty
comment: Relazione tra Space Mission e Magazine @it
domain: space mission
range: magazine
comment: Relation between Space Mission and Magazine

town
type: Class
label: ville @fr

has Album
comment: Relation between Space Mission and Album
type: ObjectProperty
range: album
domain: space mission
comment: Relazione tra Space Mission e Album @it

university
label: πανεπιστήμιο @el
label: université @fr
type: Class

protein
type: Class
label: protéine @fr

continent
type: Class
label: ήπειρος @el

ethnic group
type: Class
label: groupe ethnique @fr

has River
comment: Relazione tra Space Mission e River @it
domain: space mission
type: ObjectProperty
range: river
comment: Relation between Space Mission and River

president
label: président @fr
type: Class

album
type: Class
label: Album @de

has Office Holder
domain: space mission
comment: Relation between Space Mission and Office Holder
type: ObjectProperty
range: office holder
comment: Relazione tra Space Mission e Office Holder @it

military unit
label: unité militaire @fr
type: Class

college coach
type: Class
label: entraîneur universitaire @fr

television episode
type: Class
label: épisode télévisé @fr

basketball team
type: Class

village
label: χωριό @el
type: Class

has Military Person
comment: Relazione tra Space Mission e Military Person @it
type: ObjectProperty
comment: Relation between Space Mission and Military Person
range: military person
domain: space mission

has Drug
comment: Relazione tra Space Mission e Drug @it
domain: space mission
range: drug
type: ObjectProperty
comment: Relation between Space Mission and Drug

music genre
label: genre musical @fr
label: género musical @pt
type: Class

has School
range: school
comment: Relazione tra Space Mission e School @it
type: ObjectProperty
comment: Relation between Space Mission and School
domain: space mission

writer
label: écrivain @fr
type: Class

has Mountain
type: ObjectProperty
domain: space mission
range: mountain
comment: Relazione tra Space Mission e Mountain @it
comment: Relation between Space Mission and Mountain

baseball player
label: joueur de baseball @fr
type: Class

office holder
label: titulaire @fr
type: Class
label: Amtsinhaber @de

military conflict
type: Class
label: conflit militaire @fr

website
type: Class
label: site web @fr
label: Ιστότοπος @el

ambassador
type: Class
label: ambassadeur @fr

crustacean
type: Class
label: crustacés @fr

has Village
domain: space mission
comment: Relation between Space Mission and Village
type: ObjectProperty
range: village
comment: Relazione tra Space Mission e Village @it

has Radio Station
type: ObjectProperty
domain: space mission
comment: Relazione tra Space Mission e Radio Station @it
comment: Relation between Space Mission and Radio Station
range: radio station

has Cricketer
comment: Relazione tra Space Mission e Cricketer @it
range: cricketer
type: ObjectProperty
comment: Relation between Space Mission and Cricketer
domain: space mission

has Journalist
comment: Relazione tra Space Mission e Journalist @it
range: journalist
domain: space mission
type: ObjectProperty
comment: Relation between Space Mission and Journalist

has Governor
comment: Relation between Space Mission and Governor
type: ObjectProperty
domain: space mission
range: governor
comment: Relazione tra Space Mission e Governor @it

basketball player
type: Class
label: joueur de basketball @fr

has Election
domain: space mission
comment: Relation between Space Mission and Election
comment: Relazione tra Space Mission e Election @it
type: ObjectProperty
range: Election

has Beverage
type: ObjectProperty
range: beverage
comment: Relation between Space Mission and Beverage
domain: space mission
comment: Relazione tra Space Mission e Beverage @it

has Military Conflict
comment: Relation between Space Mission and Military Conflict
comment: Relazione tra Space Mission e Military Conflict @it
domain: space mission
type: ObjectProperty
range: military conflict

mountain range
label: chaîne de montagne @fr
type: Class

beverage
label: boisson @fr
type: Class

has Television Episode
domain: space mission
type: ObjectProperty
comment: Relazione tra Space Mission e Television Episode @it
comment: Relation between Space Mission and Television Episode
range: television episode

aircraft
label: αεροσκάφος @el
type: Class
label: avion @fr

has Congressman
range: congressman
type: ObjectProperty
comment: Relazione tra Space Mission e Congressman @it
comment: Relation between Space Mission and Congressman
domain: space mission

soccer player
type: Class
label: joueur de football @fr

has Book
comment: Relation between Space Mission and Book
type: ObjectProperty
range: book
domain: space mission
comment: Relazione tra Space Mission e Book @it

scientist
label: scientifique @fr
label: Wissenschaftler @de
type: Class

legislature
type: Class
label: pouvoir législatif @fr

has Prime Minister
comment: Relazione tra Space Mission e Prime Minister @it
range: prime minister
comment: Relation between Space Mission and Prime Minister
domain: space mission
type: ObjectProperty

airline
type: Class
label: compagnie aérienne @fr

olympics
label: Jeux Olympiques @fr
type: Class

has Mountain Range
comment: Relation between Space Mission and Mountain Range
range: mountain range
domain: space mission
type: ObjectProperty
comment: Relazione tra Space Mission e Mountain Range @it

congressman
type: Class
label: membre du Congrès @fr

has Protected Area
comment: Relation between Space Mission and Protected Area
range: protected area
type: ObjectProperty
domain: space mission
comment: Relazione tra Space Mission e Protected Area @it

has Ambassador
comment: Relation between Space Mission and Ambassador
domain: space mission
type: ObjectProperty
range: ambassador
comment: Relazione tra Space Mission e Ambassador @it

has Bacteria
comment: Relation between Space Mission and Bacteria
domain: space mission
range: bacteria
type: ObjectProperty
comment: Relazione tra Space Mission e Bacteria @it

nascar driver
type: Class
label: pilote de la nascar @fr

space mission
type: Class
label: διαστημική αποστολή @el
label: mission spatiale @fr

has Writer
comment: Relazione tra Space Mission e Writer @it
comment: Relation between Space Mission and Writer
domain: space mission
type: ObjectProperty
range: writer

journalist
label: journaliste @fr
type: Class

has Ethnic Group
domain: space mission
type: ObjectProperty
comment: Relation between Space Mission and Ethnic Group
range: ethnic group
comment: Relazione tra Space Mission e Ethnic Group @it

broadcast
type: Class
label: Émission de télévision @fr

has Film
range: film
comment: Relazione tra Space Mission e Film @it
domain: space mission
comment: Relation between Space Mission and Film
type: ObjectProperty

has Disease
comment: Relation between Space Mission and Disease
domain: space mission
comment: Relazione tra Space Mission e Disease @it
range: disease
type: ObjectProperty

insect
type: Class
label: insecte @fr

film
label: ταινία @el
type: Class

has American Football Team
range: american football team
comment: Relazione tra Space Mission e American Football Team @it
comment: Relation between Space Mission and American Football Team
domain: space mission
type: ObjectProperty

mammal
type: Class
label: mammifère @fr

has Lunar Crater
range: lunar crater
type: ObjectProperty
domain: space mission
comment: Relazione tra Space Mission e Lunar Crater @it
comment: Relation between Space Mission and Lunar Crater

american football team
type: Class
label: équipe américaine de football américain @fr

island
type: Class
label: νησί @el
label: île @fr

has Colour
domain: space mission
comment: Relation between Space Mission and Colour
type: ObjectProperty
range: colour
comment: Relazione tra Space Mission e Colour @it

has Town
comment: Relation between Space Mission and Town
comment: Relazione tra Space Mission e Town @it
type: ObjectProperty
domain: space mission
range: town

bird
type: Class
label: oiseau @fr

chemical compound
type: Class
label: produit chimique @fr

has Fish
comment: Relazione tra Space Mission e Fish @it
range: fish
comment: Relation between Space Mission and Fish
domain: space mission
type: ObjectProperty

has Flowering Plant
comment: Relation between Space Mission and Flowering Plant
type: ObjectProperty
domain: space mission
comment: Relazione tra Space Mission e Flowering Plant @it
range: flowering plant

radio station
label: station de radio @fr
type: Class

has Year In Spaceflight
comment: Relazione tra Space Mission e Year In Spaceflight @it
range: year in spaceflight
domain: space mission
comment: Relation between Space Mission and Year In Spaceflight
type: ObjectProperty

fern
type: Class
label: fougères @fr

fungus
label: fungi @fr
type: Class

has Television Show
comment: Relazione tra Space Mission e Television Show @it
comment: Relation between Space Mission and Television Show
type: ObjectProperty
domain: space mission
range: television show

has Military Unit
comment: Relazione tra Space Mission e Military Unit @it
type: ObjectProperty
range: military unit
domain: space mission
comment: Relation between Space Mission and Military Unit

conifer
type: Class
label: conifères @fr