has Historic Place
comment: Relation between Supreme Court Of The United States Case and Historic Place
type: ObjectProperty
comment: Relazione tra Supreme Court Of The United States Case e Historic Place @it
range: historic place
domain: Supreme Court of the United States case

has Anatomical Structure
type: ObjectProperty
comment: Relazione tra Supreme Court Of The United States Case e Anatomical Structure @it
range: anatomical structure
comment: Relation between Supreme Court Of The United States Case and Anatomical Structure
domain: Supreme Court of the United States case

has Book
type: ObjectProperty
comment: Relation between Supreme Court Of The United States Case and Book
range: book
comment: Relazione tra Supreme Court Of The United States Case e Book @it
domain: Supreme Court of the United States case

has River
comment: Relazione tra Supreme Court Of The United States Case e River @it
range: river
type: ObjectProperty
domain: Supreme Court of the United States case
comment: Relation between Supreme Court Of The United States Case and River

television show
label: émission de télévision @fr
type: Class

has Automobile
range: automobile
domain: Supreme Court of the United States case
comment: Relazione tra Supreme Court Of The United States Case e Automobile @it
type: ObjectProperty
comment: Relation between Supreme Court Of The United States Case and Automobile

has Village
range: village
comment: Relation between Supreme Court Of The United States Case and Village
comment: Relazione tra Supreme Court Of The United States Case e Village @it
domain: Supreme Court of the United States case
type: ObjectProperty

has Governor
type: ObjectProperty
range: governor
comment: Relazione tra Supreme Court Of The United States Case e Governor @it
comment: Relation between Supreme Court Of The United States Case and Governor
domain: Supreme Court of the United States case

has Town
range: town
comment: Relazione tra Supreme Court Of The United States Case e Town @it
domain: Supreme Court of the United States case
type: ObjectProperty
comment: Relation between Supreme Court Of The United States Case and Town

disease
type: Class
label: maladie @fr

has Weapon
type: ObjectProperty
domain: Supreme Court of the United States case
range: weapon
comment: Relation between Supreme Court Of The United States Case and Weapon
comment: Relazione tra Supreme Court Of The United States Case e Weapon @it

has College Coach
comment: Relation between Supreme Court Of The United States Case and College Coach
type: ObjectProperty
comment: Relazione tra Supreme Court Of The United States Case e College Coach @it
domain: Supreme Court of the United States case
range: college coach

has Museum
domain: Supreme Court of the United States case
range: museum
type: ObjectProperty
comment: Relazione tra Supreme Court Of The United States Case e Museum @it
comment: Relation between Supreme Court Of The United States Case and Museum

american football league
type: Class

colour
type: Class
label: couleur @fr
label: χρώμα @el

automobile
type: Class

has Flowering Plant
comment: Relation between Supreme Court Of The United States Case and Flowering Plant
comment: Relazione tra Supreme Court Of The United States Case e Flowering Plant @it
domain: Supreme Court of the United States case
range: flowering plant
type: ObjectProperty

has Military Person
comment: Relazione tra Supreme Court Of The United States Case e Military Person @it
type: ObjectProperty
comment: Relation between Supreme Court Of The United States Case and Military Person
domain: Supreme Court of the United States case
range: military person

has Song
domain: Supreme Court of the United States case
comment: Relation between Supreme Court Of The United States Case and Song
range: song
type: ObjectProperty
comment: Relazione tra Supreme Court Of The United States Case e Song @it

Election
label: élection @fr
type: Class

has Comedian
type: ObjectProperty
range: comedian
domain: Supreme Court of the United States case
comment: Relation between Supreme Court Of The United States Case and Comedian
comment: Relazione tra Supreme Court Of The United States Case e Comedian @it

has Road
domain: Supreme Court of the United States case
type: ObjectProperty
comment: Relazione tra Supreme Court Of The United States Case e Road @it
comment: Relation between Supreme Court Of The United States Case and Road
range: road

has Video Game
domain: Supreme Court of the United States case
comment: Relation between Supreme Court Of The United States Case and Video Game
comment: Relazione tra Supreme Court Of The United States Case e Video Game @it
range: video game
type: ObjectProperty

has Ethnic Group
domain: Supreme Court of the United States case
type: ObjectProperty
comment: Relation between Supreme Court Of The United States Case and Ethnic Group
comment: Relazione tra Supreme Court Of The United States Case e Ethnic Group @it
range: ethnic group

american football player
label: joueur de football américain @fr
type: Class

stadium
type: Class
label: stade @fr

has American Football Player
range: american football player
type: ObjectProperty
comment: Relation between Supreme Court Of The United States Case and American Football Player
domain: Supreme Court of the United States case
comment: Relazione tra Supreme Court Of The United States Case e American Football Player @it

soccer league
label: ligue de football @fr
type: Class

has Senator
range: senator
comment: Relazione tra Supreme Court Of The United States Case e Senator @it
type: ObjectProperty
comment: Relation between Supreme Court Of The United States Case and Senator
domain: Supreme Court of the United States case

has Criminal
comment: Relation between Supreme Court Of The United States Case and Criminal
domain: Supreme Court of the United States case
type: ObjectProperty
comment: Relazione tra Supreme Court Of The United States Case e Criminal @it
range: criminal

has Fish
type: ObjectProperty
range: fish
comment: Relazione tra Supreme Court Of The United States Case e Fish @it
domain: Supreme Court of the United States case
comment: Relation between Supreme Court Of The United States Case and Fish

has Monument
range: monument
type: ObjectProperty
comment: Relazione tra Supreme Court Of The United States Case e Monument @it
comment: Relation between Supreme Court Of The United States Case and Monument
domain: Supreme Court of the United States case

has Television Show
range: television show
domain: Supreme Court of the United States case
comment: Relation between Supreme Court Of The United States Case and Television Show
type: ObjectProperty
comment: Relazione tra Supreme Court Of The United States Case e Television Show @it

has Currency
domain: Supreme Court of the United States case
comment: Relation between Supreme Court Of The United States Case and Currency
range: currency
comment: Relazione tra Supreme Court Of The United States Case e Currency @it
type: ObjectProperty

has Baseball Player
comment: Relation between Supreme Court Of The United States Case and Baseball Player
domain: Supreme Court of the United States case
comment: Relazione tra Supreme Court Of The United States Case e Baseball Player @it
range: baseball player
type: ObjectProperty

basketball league
type: Class
label: ligue de basketball @fr

criminal
type: Class
label: criminel @fr

has Website
type: ObjectProperty
comment: Relazione tra Supreme Court Of The United States Case e Website @it
range: website
domain: Supreme Court of the United States case
comment: Relation between Supreme Court Of The United States Case and Website

flowering plant
label: angiospermes @fr
type: Class

has Canal
range: canal
domain: Supreme Court of the United States case
comment: Relation between Supreme Court Of The United States Case and Canal
type: ObjectProperty
comment: Relazione tra Supreme Court Of The United States Case e Canal @it

senator
type: Class
label: sénateur @fr

has American Football League
comment: Relazione tra Supreme Court Of The United States Case e American Football League @it
range: american football league
domain: Supreme Court of the United States case
type: ObjectProperty
comment: Relation between Supreme Court Of The United States Case and American Football League

has Chemical Compound
type: ObjectProperty
domain: Supreme Court of the United States case
comment: Relazione tra Supreme Court Of The United States Case e Chemical Compound @it
range: chemical compound
comment: Relation between Supreme Court Of The United States Case and Chemical Compound

comedian
label: comédien @fr
type: Class

song
type: Class
label: chanson @fr

newspaper
label: journal @fr
type: Class

has Language
type: ObjectProperty
comment: Relation between Supreme Court Of The United States Case and Language
domain: Supreme Court of the United States case
range: language
comment: Relazione tra Supreme Court Of The United States Case e Language @it

protected area
type: Class
label: προστατευμένη περιοχή @el
label: aire protégée @fr

road
label: route @fr
type: Class

boxer
type: Class
label: boxeur @fr

book
type: Class
label: livre @fr
label: βιβλίο @el
label: książka @pl
label: llibre @ca

has Bird
range: bird
comment: Relation between Supreme Court Of The United States Case and Bird
type: ObjectProperty
domain: Supreme Court of the United States case
comment: Relazione tra Supreme Court Of The United States Case e Bird @it

has Award
domain: Supreme Court of the United States case
comment: Relazione tra Supreme Court Of The United States Case e Award @it
type: ObjectProperty
range: award
comment: Relation between Supreme Court Of The United States Case and Award

has Colour
comment: Relazione tra Supreme Court Of The United States Case e Colour @it
range: colour
type: ObjectProperty
domain: Supreme Court of the United States case
comment: Relation between Supreme Court Of The United States Case and Colour

shopping mall
label: centre commercial @fr
type: Class

has School
comment: Relazione tra Supreme Court Of The United States Case e School @it
range: school
comment: Relation between Supreme Court Of The United States Case and School
domain: Supreme Court of the United States case
type: ObjectProperty

has Adult Actor
range: adult actor
domain: Supreme Court of the United States case
comment: Relazione tra Supreme Court Of The United States Case e Adult Actor @it
comment: Relation between Supreme Court Of The United States Case and Adult Actor
type: ObjectProperty

has Film
range: film
comment: Relation between Supreme Court Of The United States Case and Film
domain: Supreme Court of the United States case
type: ObjectProperty
comment: Relazione tra Supreme Court Of The United States Case e Film @it

has Insect
domain: Supreme Court of the United States case
type: ObjectProperty
comment: Relazione tra Supreme Court Of The United States Case e Insect @it
range: insect
comment: Relation between Supreme Court Of The United States Case and Insect

station
type: Class

language
label: langage @fr
type: Class

has Basketball League
comment: Relation between Supreme Court Of The United States Case and Basketball League
domain: Supreme Court of the United States case
type: ObjectProperty
range: basketball league
comment: Relazione tra Supreme Court Of The United States Case e Basketball League @it

bacteria
label: bactérie @fr
type: Class

non-profit organisation
type: Class
label: organisation à but non lucratif @fr

has Writer
domain: Supreme Court of the United States case
range: writer
comment: Relazione tra Supreme Court Of The United States Case e Writer @it
type: ObjectProperty
comment: Relation between Supreme Court Of The United States Case and Writer

has Island
domain: Supreme Court of the United States case
range: island
comment: Relation between Supreme Court Of The United States Case and Island
comment: Relazione tra Supreme Court Of The United States Case e Island @it
type: ObjectProperty

lake
type: Class
label: lac @fr

weapon
type: Class
label: arme @fr

governor
type: Class
label: gouverneur @fr

drug
label: médicament @fr
type: Class

has Soccer Club
comment: Relation between Supreme Court Of The United States Case and Soccer Club
comment: Relazione tra Supreme Court Of The United States Case e Soccer Club @it
domain: Supreme Court of the United States case
range: soccer club
type: ObjectProperty

river
type: Class
label: rivière @fr

has Band
type: ObjectProperty
range: Band
domain: Supreme Court of the United States case
comment: Relation between Supreme Court Of The United States Case and Band
comment: Relazione tra Supreme Court Of The United States Case e Band @it

magazine
label: περιοδικό @el
type: Class

has Scientist
domain: Supreme Court of the United States case
type: ObjectProperty
comment: Relazione tra Supreme Court Of The United States Case e Scientist @it
range: scientist
comment: Relation between Supreme Court Of The United States Case and Scientist

school
type: Class
label: école @fr

ship
type: Class
label: navire @fr

has Congressman
comment: Relazione tra Supreme Court Of The United States Case e Congressman @it
range: congressman
comment: Relation between Supreme Court Of The United States Case and Congressman
type: ObjectProperty
domain: Supreme Court of the United States case

has Journalist
comment: Relation between Supreme Court Of The United States Case and Journalist
domain: Supreme Court of the United States case
type: ObjectProperty
range: journalist
comment: Relazione tra Supreme Court Of The United States Case e Journalist @it

museum
type: Class
label: musée @fr

fish
type: Class
label: poisson @fr

has Philosopher
comment: Relazione tra Supreme Court Of The United States Case e Philosopher @it
comment: Relation between Supreme Court Of The United States Case and Philosopher
type: ObjectProperty
range: philosopher
domain: Supreme Court of the United States case

video game
label: jeux vidéo @fr
type: Class

canal
type: Class

trade union
label: syndicat professionnel @fr
type: Class

military person
type: Class
label: militaire @fr

has Boxer
comment: Relation between Supreme Court Of The United States Case and Boxer
range: boxer
comment: Relazione tra Supreme Court Of The United States Case e Boxer @it
domain: Supreme Court of the United States case
type: ObjectProperty

philosopher
type: Class
label: philosophe @fr

currency
label: devise @fr
type: Class

award
type: Class
label: récompense @fr

prime minister
type: Class
label: premier ministre @fr

has Ice Hockey League
domain: Supreme Court of the United States case
range: ice hockey league
type: ObjectProperty
comment: Relation between Supreme Court Of The United States Case and Ice Hockey League
comment: Relazione tra Supreme Court Of The United States Case e Ice Hockey League @it

British royalty
label: royauté Britannique @fr
type: Class

has Sport
type: ObjectProperty
comment: Relation between Supreme Court Of The United States Case and Sport
range: sport
comment: Relazione tra Supreme Court Of The United States Case e Sport @it
domain: Supreme Court of the United States case

historic place
type: Class
label: site historique @fr

has Hockey Team
comment: Relazione tra Supreme Court Of The United States Case e Hockey Team @it
domain: Supreme Court of the United States case
range: hockey team
type: ObjectProperty
comment: Relation between Supreme Court Of The United States Case and Hockey Team

hospital
label: hôpital @fr
type: Class

anatomical structure
label: structure anatomique @fr
type: Class

monument
type: Class

sport
type: Class

single
type: Class

Band
label: banda @pt
label: Musikgruppe @de
type: Class
label: groupe de musique @fr

town
label: ville @fr
type: Class

has Disease
type: ObjectProperty
comment: Relazione tra Supreme Court Of The United States Case e Disease @it
range: disease
domain: Supreme Court of the United States case
comment: Relation between Supreme Court Of The United States Case and Disease

university
type: Class
label: université @fr
label: πανεπιστήμιο @el

continent
type: Class
label: ήπειρος @el

ethnic group
type: Class
label: groupe ethnique @fr

has Reptile
type: ObjectProperty
comment: Relazione tra Supreme Court Of The United States Case e Reptile @it
range: reptile
comment: Relation between Supreme Court Of The United States Case and Reptile
domain: Supreme Court of the United States case

has Lake
domain: Supreme Court of the United States case
range: lake
comment: Relazione tra Supreme Court Of The United States Case e Lake @it
type: ObjectProperty
comment: Relation between Supreme Court Of The United States Case and Lake

president
label: président @fr
type: Class

has Basketball Team
comment: Relazione tra Supreme Court Of The United States Case e Basketball Team @it
range: basketball team
comment: Relation between Supreme Court Of The United States Case and Basketball Team
type: ObjectProperty
domain: Supreme Court of the United States case

Ontology
has author: Aldo Gangemi
has author: Valentina Presutti
extracted from: en.wikipedia.org
comment: SupremeCourtOfTheUnitedStatesCase Encyclopedic Knowledge Pattern
extracted from: dbpedia.org
has intent: To represent the encyclopedic knowledge expressed by an object typed as SupremeCourtOfTheUnitedStatesCase
imports: cpannotationschema.owl
has author: Andrea Giovanni Nuzzolese

has Record Label
type: ObjectProperty
range: record label
comment: Relazione tra Supreme Court Of The United States Case e Record Label @it
comment: Relation between Supreme Court Of The United States Case and Record Label
domain: Supreme Court of the United States case

has Mammal
comment: Relation between Supreme Court Of The United States Case and Mammal
type: ObjectProperty
domain: Supreme Court of the United States case
comment: Relazione tra Supreme Court Of The United States Case e Mammal @it
range: mammal

military unit
type: Class
label: unité militaire @fr

college coach
type: Class
label: entraîneur universitaire @fr

basketball team
type: Class

village
type: Class
label: χωριό @el

ice hockey league
type: Class
label: ligue d'hockey sur glace @fr

has Bacteria
comment: Relation between Supreme Court Of The United States Case and Bacteria
comment: Relazione tra Supreme Court Of The United States Case e Bacteria @it
type: ObjectProperty
range: bacteria
domain: Supreme Court of the United States case

has Magazine
domain: Supreme Court of the United States case
range: magazine
type: ObjectProperty
comment: Relation between Supreme Court Of The United States Case and Magazine
comment: Relazione tra Supreme Court Of The United States Case e Magazine @it

soccer club
label: club de football @fr
type: Class

has Radio Station
range: radio station
domain: Supreme Court of the United States case
type: ObjectProperty
comment: Relation between Supreme Court Of The United States Case and Radio Station
comment: Relazione tra Supreme Court Of The United States Case e Radio Station @it

has Ship
comment: Relation between Supreme Court Of The United States Case and Ship
domain: Supreme Court of the United States case
type: ObjectProperty
comment: Relazione tra Supreme Court Of The United States Case e Ship @it
range: ship

writer
label: écrivain @fr
type: Class

record label
type: Class
label: label discographique @fr

baseball player
label: joueur de baseball @fr
type: Class

has Golf League
type: ObjectProperty
range: golf league
comment: Relation between Supreme Court Of The United States Case and Golf League
comment: Relazione tra Supreme Court Of The United States Case e Golf League @it
domain: Supreme Court of the United States case

architect
type: Class
label: architecte @fr

military conflict
type: Class
label: conflit militaire @fr

website
type: Class
label: site web @fr
label: Ιστότοπος @el

has Continent
comment: Relazione tra Supreme Court Of The United States Case e Continent @it
comment: Relation between Supreme Court Of The United States Case and Continent
type: ObjectProperty
range: continent
domain: Supreme Court of the United States case

has Airline
comment: Relation between Supreme Court Of The United States Case and Airline
comment: Relazione tra Supreme Court Of The United States Case e Airline @it
domain: Supreme Court of the United States case
range: airline
type: ObjectProperty

adult actor
label: acteur adulte @fr
type: Class
label: erwachsener Schauspieler @de

has Musical Artist
range: musical artist
comment: Relazione tra Supreme Court Of The United States Case e Musical Artist @it
domain: Supreme Court of the United States case
type: ObjectProperty
comment: Relation between Supreme Court Of The United States Case and Musical Artist

has Newspaper
domain: Supreme Court of the United States case
comment: Relazione tra Supreme Court Of The United States Case e Newspaper @it
comment: Relation between Supreme Court Of The United States Case and Newspaper
range: newspaper
type: ObjectProperty

has Architect
domain: Supreme Court of the United States case
type: ObjectProperty
range: architect
comment: Relazione tra Supreme Court Of The United States Case e Architect @it
comment: Relation between Supreme Court Of The United States Case and Architect

has Shopping Mall
type: ObjectProperty
comment: Relazione tra Supreme Court Of The United States Case e Shopping Mall @it
range: shopping mall
comment: Relation between Supreme Court Of The United States Case and Shopping Mall
domain: Supreme Court of the United States case

has Non- Profit Organisation
type: ObjectProperty
comment: Relazione tra Supreme Court Of The United States Case e Non- Profit Organisation @it
domain: Supreme Court of the United States case
comment: Relation between Supreme Court Of The United States Case and Non- Profit Organisation
range: non-profit organisation

has Broadcast
type: ObjectProperty
comment: Relation between Supreme Court Of The United States Case and Broadcast
range: broadcast
domain: Supreme Court of the United States case
comment: Relazione tra Supreme Court Of The United States Case e Broadcast @it

has Monarch
comment: Relation between Supreme Court Of The United States Case and Monarch
comment: Relazione tra Supreme Court Of The United States Case e Monarch @it
type: ObjectProperty
range: monarch
domain: Supreme Court of the United States case

has Soccer League
range: soccer league
comment: Relation between Supreme Court Of The United States Case and Soccer League
comment: Relazione tra Supreme Court Of The United States Case e Soccer League @it
domain: Supreme Court of the United States case
type: ObjectProperty

has Stadium
range: stadium
comment: Relation between Supreme Court Of The United States Case and Stadium
type: ObjectProperty
domain: Supreme Court of the United States case
comment: Relazione tra Supreme Court Of The United States Case e Stadium @it

has Military Unit
range: military unit
comment: Relation between Supreme Court Of The United States Case and Military Unit
comment: Relazione tra Supreme Court Of The United States Case e Military Unit @it
domain: Supreme Court of the United States case
type: ObjectProperty

has President
comment: Relazione tra Supreme Court Of The United States Case e President @it
domain: Supreme Court of the United States case
type: ObjectProperty
range: president
comment: Relation between Supreme Court Of The United States Case and President

has Single
comment: Relation between Supreme Court Of The United States Case and Single
comment: Relazione tra Supreme Court Of The United States Case e Single @it
domain: Supreme Court of the United States case
type: ObjectProperty
range: single

hockey team
label: équipe de hockey @fr
type: Class

scientist
label: Wissenschaftler @de
type: Class
label: scientifique @fr

has Station
comment: Relazione tra Supreme Court Of The United States Case e Station @it
comment: Relation between Supreme Court Of The United States Case and Station
domain: Supreme Court of the United States case
range: station
type: ObjectProperty

has Airport
range: airport
domain: Supreme Court of the United States case
comment: Relazione tra Supreme Court Of The United States Case e Airport @it
comment: Relation between Supreme Court Of The United States Case and Airport
type: ObjectProperty

reptile
type: Class

has Trade Union
type: ObjectProperty
range: trade union
comment: Relazione tra Supreme Court Of The United States Case e Trade Union @it
comment: Relation between Supreme Court Of The United States Case and Trade Union
domain: Supreme Court of the United States case

golf league
type: Class
label: ligue de golf @fr

has Military Conflict
comment: Relazione tra Supreme Court Of The United States Case e Military Conflict @it
domain: Supreme Court of the United States case
comment: Relation between Supreme Court Of The United States Case and Military Conflict
range: military conflict
type: ObjectProperty

airline
type: Class
label: compagnie aérienne @fr

olympics
label: Jeux Olympiques @fr
type: Class

has American Football Team
type: ObjectProperty
comment: Relazione tra Supreme Court Of The United States Case e American Football Team @it
comment: Relation between Supreme Court Of The United States Case and American Football Team
domain: Supreme Court of the United States case
range: american football team

monarch
type: Class
label: monarque @fr

baseball league
type: Class
label: ligue de baseball @fr

congressman
label: membre du Congrès @fr
type: Class

has University
comment: Relation between Supreme Court Of The United States Case and University
type: ObjectProperty
range: university
domain: Supreme Court of the United States case
comment: Relazione tra Supreme Court Of The United States Case e University @it

journalist
type: Class
label: journaliste @fr

broadcast
label: Émission de télévision @fr
type: Class

has Drug
comment: Relazione tra Supreme Court Of The United States Case e Drug @it
range: drug
type: ObjectProperty
comment: Relation between Supreme Court Of The United States Case and Drug
domain: Supreme Court of the United States case

has British Royalty
type: ObjectProperty
comment: Relation between Supreme Court Of The United States Case and British Royalty
range: British royalty
comment: Relazione tra Supreme Court Of The United States Case e British Royalty @it
domain: Supreme Court of the United States case

insect
type: Class
label: insecte @fr

film
label: ταινία @el
type: Class

mammal
type: Class
label: mammifère @fr

american football team
label: équipe américaine de football américain @fr
type: Class

island
type: Class
label: νησί @el
label: île @fr

has Prime Minister
range: prime minister
comment: Relazione tra Supreme Court Of The United States Case e Prime Minister @it
domain: Supreme Court of the United States case
type: ObjectProperty
comment: Relation between Supreme Court Of The United States Case and Prime Minister

Supreme Court of the United States case
label: cas juridique de la Cour suprême des États-Unis @fr
type: Class

has Baseball League
comment: Relazione tra Supreme Court Of The United States Case e Baseball League @it
range: baseball league
domain: Supreme Court of the United States case
type: ObjectProperty
comment: Relation between Supreme Court Of The United States Case and Baseball League

has Protected Area
domain: Supreme Court of the United States case
range: protected area
comment: Relation between Supreme Court Of The United States Case and Protected Area
type: ObjectProperty
comment: Relazione tra Supreme Court Of The United States Case e Protected Area @it

bird
type: Class
label: oiseau @fr

chemical compound
type: Class
label: produit chimique @fr

radio station
type: Class
label: station de radio @fr

has Election
domain: Supreme Court of the United States case
type: ObjectProperty
range: Election
comment: Relation between Supreme Court Of The United States Case and Election
comment: Relazione tra Supreme Court Of The United States Case e Election @it

has Olympics
comment: Relazione tra Supreme Court Of The United States Case e Olympics @it
range: olympics
type: ObjectProperty
comment: Relation between Supreme Court Of The United States Case and Olympics
domain: Supreme Court of the United States case

musical artist
label: artista musical @pt
type: Class
label: musicien @fr

has Hospital
domain: Supreme Court of the United States case
type: ObjectProperty
range: hospital
comment: Relazione tra Supreme Court Of The United States Case e Hospital @it
comment: Relation between Supreme Court Of The United States Case and Hospital

airport
type: Class
label: Flughafen @de
label: aéroport @fr