has Boxer
related match: voices
related match: starring
domain: television show
comment: Relation between Television Show and Boxer
range: boxer
comment: Relazione tra Television Show e Boxer @it
type: ObjectProperty

television show
label: émission de télévision @fr
type: Class

has Embryology
comment: Relation between Television Show and Embryology
type: ObjectProperty
range: embryology
comment: Relazione tra Television Show e Embryology @it
domain: television show

has Prime Minister
related match: starring
type: ObjectProperty
comment: Relazione tra Television Show e Prime Minister @it
range: prime minister
comment: Relation between Television Show and Prime Minister
domain: television show

automobile
type: Class

colour
label: χρώμα @el
label: couleur @fr
type: Class

has Military Unit
comment: Relation between Television Show and Military Unit
type: ObjectProperty
domain: television show
comment: Relazione tra Television Show e Military Unit @it
range: military unit

Election
type: Class
label: élection @fr

Axiom
annotated source: has Figure Skater
matching quantification: 1
annotated target: voices

Axiom
annotated target: presenter
annotated source: has Comedian
matching quantification: 24

has College Coach
related match: executiveProducer
related match: starring
related match: creator percent 28s percent 29
comment: Relation between Television Show and College Coach
type: ObjectProperty
comment: Relazione tra Television Show e College Coach @it
domain: television show
range: college coach

has Poker Player
related match: director
related match: creator
related match: starring
type: ObjectProperty
comment: Relation between Television Show and Poker Player
domain: television show
comment: Relazione tra Television Show e Poker Player @it
range: poker player

Axiom
annotated target: company
annotated source: has Comics Creator
matching quantification: 1

soccer league
type: Class
label: ligue de football @fr

Axiom
annotated source: has Model
matching quantification: 1
annotated target: aux

has Judge
range: judge
type: ObjectProperty
comment: Relazione tra Television Show e Judge @it
domain: television show
comment: Relation between Television Show and Judge

has Senator
type: ObjectProperty
range: senator
comment: Relation between Television Show and Senator
domain: television show
comment: Relazione tra Television Show e Senator @it
related match: director
related match: executiveProducer
related match: starring

has Soccer Player
related match: editor
related match: developer
related match: executiveProducer
related match: aux
related match: starring
related match: voices
type: ObjectProperty
related match: writtenby
related match: pundits
range: soccer player
related match: storyEditor
domain: television show
related match: presenter
related match: producer
related match: judges
comment: Relation between Television Show and Soccer Player
comment: Relazione tra Television Show e Soccer Player @it
related match: creator

has Journalist
related match: before
domain: television show
related match: presenter
comment: Relazione tra Television Show e Journalist @it
related match: executiveProducer
comment: Relation between Television Show and Journalist
related match: aux
range: journalist
related match: starring
related match: producer
related match: creator
related match: judges
type: ObjectProperty

Axiom
annotated target: tvSeriesWrittenBy
matching quantification: 1
annotated source: has Comedian

wrestler
label: lutteur @fr
type: Class

has Ethnic Group
type: ObjectProperty
comment: Relazione tra Television Show e Ethnic Group @it
comment: Relation between Television Show and Ethnic Group
domain: television show
range: ethnic group

Axiom
matching quantification: 2
annotated source: has Member Of Parliament
annotated target: voices

Axiom
annotated target: starring
matching quantification: 1
annotated source: has Cricketer

road
label: route @fr
type: Class

has Green Alga
type: ObjectProperty
comment: Relazione tra Television Show e Green Alga @it
range: green alga
comment: Relation between Television Show and Green Alga
domain: television show

has Hockey Team
type: ObjectProperty
domain: television show
comment: Relazione tra Television Show e Hockey Team @it
comment: Relation between Television Show and Hockey Team
range: hockey team

boxer
label: boxeur @fr
type: Class

has Scientist
comment: Relation between Television Show and Scientist
type: ObjectProperty
range: scientist
domain: television show
comment: Relazione tra Television Show e Scientist @it
related match: writer
related match: starring
related match: creator

judge
type: Class
label: juge @fr

Axiom
annotated target: writer
annotated source: has Scientist
matching quantification: 1

World Heritage Site
label: site du patrimoine mondial @fr
type: Class

has Aircraft
domain: television show
type: ObjectProperty
range: aircraft
comment: Relazione tra Television Show e Aircraft @it
comment: Relation between Television Show and Aircraft

Women's Tennis Association tournament
type: Class
label: Tournoi de la Women's Tennis Association @fr

has Weapon
comment: Relation between Television Show and Weapon
domain: television show
range: weapon
type: ObjectProperty
comment: Relazione tra Television Show e Weapon @it

station
type: Class

has Cardinal
type: ObjectProperty
range: cardinal
domain: television show
comment: Relazione tra Television Show e Cardinal @it
comment: Relation between Television Show and Cardinal

has World Heritage Site
range: World Heritage Site
comment: Relazione tra Television Show e World Heritage Site @it
domain: television show
comment: Relation between Television Show and World Heritage Site
type: ObjectProperty

Axiom
annotated source: has Cricketer
matching quantification: 2
annotated target: presenter

lake
label: lac @fr
type: Class

has Playboy Playmate
range: Playboy Playmate
comment: Relazione tra Television Show e Playboy Playmate @it
comment: Relation between Television Show and Playboy Playmate
domain: television show
type: ObjectProperty
related match: starring

Axiom
annotated source: has Baseball Player
annotated target: starring
matching quantification: 30

arachnid
type: Class
label: arachnides @fr

governor
label: gouverneur @fr
type: Class

has Radio Station
comment: Relation between Television Show and Radio Station
type: ObjectProperty
domain: television show
range: radio station
comment: Relazione tra Television Show e Radio Station @it

has Gaelic Games Player
related match: starring
related match: presenter
type: ObjectProperty
comment: Relation between Television Show and Gaelic Games Player
domain: television show
comment: Relazione tra Television Show e Gaelic Games Player @it
range: Gaelic games player

Axiom
annotated target: starring
matching quantification: 9
annotated source: has Wrestler

poker player
type: Class
label: joueur de poker @fr

has Insect
comment: Relation between Television Show and Insect
type: ObjectProperty
range: insect
comment: Relazione tra Television Show e Insect @it
domain: television show

ship
label: navire @fr
type: Class

fish
label: poisson @fr
type: Class

tennis player
type: Class
label: joueur de tennis @fr

has Model
related match: presenter
related match: aux
range: model
comment: Relazione tra Television Show e Model @it
comment: Relation between Television Show and Model
related match: starring
related match: judges
type: ObjectProperty
domain: television show
related match: voices

has Village
domain: television show
range: village
comment: Relation between Television Show and Village
comment: Relazione tra Television Show e Village @it
type: ObjectProperty
related match: location

prime minister
type: Class
label: premier ministre @fr

Axiom
annotated target: starring
annotated source: has Senator
matching quantification: 3

Axiom
annotated target: createdBy
matching quantification: 1
annotated source: has Comics Creator

race
type: Class
label: course @fr

hospital
label: hôpital @fr
type: Class

lunar crater
type: Class
label: cratère lunaire @fr

Axiom
annotated source: has Ice Hockey Player
matching quantification: 9
annotated target: starring

Axiom
matching quantification: 1
annotated target: judges
annotated source: has Journalist

Axiom
annotated target: starring
annotated source: has Military Person
matching quantification: 5

album
label: Album @de
type: Class

president
label: président @fr
type: Class

Axiom
annotated source: has Military Person
annotated target: writer
matching quantification: 1

moss
label: mousses @fr
type: Class

Axiom
annotated source: has Soccer Player
annotated target: aux
matching quantification: 2

military unit
label: unité militaire @fr
type: Class

Axiom
annotated source: has Adult Actor
annotated target: judges
matching quantification: 1

soccer manager
label: entraîneur de football @fr
type: Class

basketball team
type: Class

Axiom
matching quantification: 17
annotated source: has Gaelic Games Player
annotated target: starring

has Lake
comment: Relation between Television Show and Lake
domain: television show
range: lake
comment: Relazione tra Television Show e Lake @it
type: ObjectProperty

Axiom
matching quantification: 4
annotated source: has Scientist
annotated target: starring

has Fish
domain: television show
comment: Relation between Television Show and Fish
comment: Relazione tra Television Show e Fish @it
type: ObjectProperty
range: fish

cycad
type: Class
label: cycadophytes @fr

has Hotel
range: hotel
comment: Relation between Television Show and Hotel
domain: television show
type: ObjectProperty
comment: Relazione tra Television Show e Hotel @it

Axiom
matching quantification: 1
annotated target: presenter
annotated source: has Wrestler

crustacean
label: crustacés @fr
type: Class

has Nascar Driver
comment: Relation between Television Show and Nascar Driver
comment: Relazione tra Television Show e Nascar Driver @it
domain: television show
type: ObjectProperty
range: nascar driver
related match: starring

Axiom
matching quantification: 48
annotated target: starring
annotated source: has American Football Player

film festival
label: festival du film @fr
type: Class

has Legislature
range: legislature
comment: Relazione tra Television Show e Legislature @it
comment: Relation between Television Show and Legislature
type: ObjectProperty
domain: television show

Axiom
annotated source: has Senator
matching quantification: 1
annotated target: executiveProducer

has Museum
type: ObjectProperty
comment: Relazione tra Television Show e Museum @it
domain: television show
comment: Relation between Television Show and Museum
range: museum

has Newspaper
comment: Relation between Television Show and Newspaper
type: ObjectProperty
comment: Relazione tra Television Show e Newspaper @it
domain: television show
range: newspaper

has Bird
type: ObjectProperty
comment: Relation between Television Show and Bird
range: bird
comment: Relazione tra Television Show e Bird @it
domain: television show

lighthouse
type: Class
label: phare @fr

has Vein
range: vein
type: ObjectProperty
comment: Relazione tra Television Show e Vein @it
comment: Relation between Television Show and Vein
domain: television show

aircraft
label: αεροσκάφος @el
type: Class
label: avion @fr

Axiom
annotated source: has Airport
matching quantification: 4
annotated target: location

Axiom
annotated target: producer
annotated source: has Office Holder
matching quantification: 1

Axiom
annotated source: has Comics Creator
annotated target: executiveProducer
matching quantification: 6

Axiom
annotated source: has Soccer Player
annotated target: developer
matching quantification: 1

legislature
type: Class
label: pouvoir législatif @fr

has Ski Area
domain: television show
comment: Relazione tra Television Show e Ski Area @it
comment: Relation between Television Show and Ski Area
range: ski area
type: ObjectProperty

Axiom
annotated source: has Military Person
annotated target: creator
matching quantification: 1

airline
label: compagnie aérienne @fr
type: Class

Axiom
annotated target: creator
matching quantification: 1
annotated source: has Criminal

monarch
type: Class
label: monarque @fr

has Canal
comment: Relation between Television Show and Canal
range: canal
domain: television show
type: ObjectProperty
comment: Relazione tra Television Show e Canal @it

golf player
type: Class
label: golfeur @fr

nascar driver
label: pilote de la nascar @fr
type: Class

space mission
label: mission spatiale @fr
label: διαστημική αποστολή @el
type: Class

Axiom
matching quantification: 5
annotated target: starring
annotated source: has Boxer

has Award
related match: title
comment: Relazione tra Television Show e Award @it
range: award
type: ObjectProperty
comment: Relation between Television Show and Award
domain: television show

insect
type: Class
label: insecte @fr

Axiom
annotated target: aux
matching quantification: 3
annotated source: has Journalist

has Chemical Compound
type: ObjectProperty
comment: Relation between Television Show and Chemical Compound
comment: Relazione tra Television Show e Chemical Compound @it
domain: television show
range: chemical compound

Axiom
matching quantification: 1
annotated target: opentheme
annotated source: has Single

has Mammal
related match: company
related match: network
domain: television show
type: ObjectProperty
range: mammal
comment: Relation between Television Show and Mammal
comment: Relazione tra Television Show e Mammal @it

Supreme Court of the United States case
type: Class
label: cas juridique de la Cour suprême des États-Unis @fr

Axiom
annotated source: has American Football Player
matching quantification: 3
annotated target: presenter

Axiom
matching quantification: 1
annotated target: creator
annotated source: has Scientist

Gaelic games player
type: Class
label: joueur de sports gaéliques @fr

has Rocket
type: ObjectProperty
comment: Relation between Television Show and Rocket
domain: television show
range: rocket
comment: Relazione tra Television Show e Rocket @it

has Wrestler
related match: developer
related match: presenter
comment: Relazione tra Television Show e Wrestler @it
related match: producer
related match: executiveProducer
domain: television show
range: wrestler
related match: starring
comment: Relation between Television Show and Wrestler
related match: creator
type: ObjectProperty

has Book
domain: television show
type: ObjectProperty
comment: Relazione tra Television Show e Book @it
comment: Relation between Television Show and Book
range: book
related match: related

fungus
label: fungi @fr
type: Class

has Soccer Club
comment: Relation between Television Show and Soccer Club
comment: Relazione tra Television Show e Soccer Club @it
domain: television show
range: soccer club
type: ObjectProperty

has Mountain Range
range: mountain range
type: ObjectProperty
comment: Relazione tra Television Show e Mountain Range @it
comment: Relation between Television Show and Mountain Range
domain: television show

Axiom
matching quantification: 22
annotated target: executiveProducer
annotated source: has Comedian

has Architect
type: ObjectProperty
domain: television show
comment: Relazione tra Television Show e Architect @it
range: architect
comment: Relation between Television Show and Architect
related match: starring

park
type: Class
label: parc @fr

brain
type: Class
label: cerveau @fr

Ontology
has author: Valentina Presutti
extracted from: en.wikipedia.org
comment: TelevisionShow Encyclopedic Knowledge Pattern
extracted from: dbpedia.org
has author: Andrea Giovanni Nuzzolese
has author: Aldo Gangemi
has intent: To represent the encyclopedic knowledge expressed by an object typed as TelevisionShow
imports: cpannotationschema.owl

has Locomotive
range: locomotive
domain: television show
comment: Relazione tra Television Show e Locomotive @it
type: ObjectProperty
comment: Relation between Television Show and Locomotive

has Reptile
comment: Relation between Television Show and Reptile
domain: television show
type: ObjectProperty
range: reptile
comment: Relazione tra Television Show e Reptile @it

cardinal
type: Class

rugby player
label: joueur de rugby @fr
type: Class

has Music Festival
type: ObjectProperty
domain: television show
comment: Relation between Television Show and Music Festival
comment: Relazione tra Television Show e Music Festival @it
range: music festival

american football league
type: Class

Axiom
annotated source: has Mammal
matching quantification: 1
annotated target: company

has Wrestling Event
comment: Relazione tra Television Show e Wrestling Event @it
type: ObjectProperty
domain: television show
range: wrestling event
comment: Relation between Television Show and Wrestling Event

Axiom
annotated target: aux
matching quantification: 3
annotated source: has Automobile

Axiom
annotated source: has American Football Player
annotated target: creator
matching quantification: 1

has Road
range: road
domain: television show
type: ObjectProperty
comment: Relazione tra Television Show e Road @it
comment: Relation between Television Show and Road

cyclist
type: Class
label: cycliste @fr

Axiom
annotated target: format
annotated source: has Sport
matching quantification: 1

Axiom
matching quantification: 1
annotated target: commentators
annotated source: has American Football Player

national collegiate athletic association athlete
label: athlète de la national collegiate athletic association @fr
type: Class

wrestling event
label: match de catch @fr
type: Class

Axiom
annotated target: cameras
annotated source: has Ice Hockey Player
matching quantification: 1

basketball league
type: Class
label: ligue de basketball @fr

has Baseball Player
comment: Relazione tra Television Show e Baseball Player @it
comment: Relation between Television Show and Baseball Player
type: ObjectProperty
range: baseball player
domain: television show
related match: judges
related match: starring
related match: director

has Space Station
comment: Relazione tra Television Show e Space Station @it
domain: television show
comment: Relation between Television Show and Space Station
range: space station
type: ObjectProperty

Axiom
annotated target: title
matching quantification: 15
annotated source: has Award

senator
label: sénateur @fr
type: Class

saint
type: Class

Axiom
matching quantification: 1
annotated target: executiveProducer
annotated source: has Rugby Player

Axiom
matching quantification: 1
annotated target: producer
annotated source: has Journalist

has Videogames League
comment: Relation between Television Show and Videogames League
comment: Relazione tra Television Show e Videogames League @it
range: videogames league
type: ObjectProperty
domain: television show

convention
label: congrès @fr
type: Class

has Planet
comment: Relazione tra Television Show e Planet @it
range: planet
domain: television show
comment: Relation between Television Show and Planet
type: ObjectProperty

has Trade Union
comment: Relazione tra Television Show e Trade Union @it
range: trade union
comment: Relation between Television Show and Trade Union
type: ObjectProperty
domain: television show

Axiom
annotated source: has Figure Skater
matching quantification: 2
annotated target: judges

book
type: Class
label: livre @fr
label: βιβλίο @el
label: llibre @ca
label: książka @pl

shopping mall
type: Class
label: centre commercial @fr

has Colour
comment: Relazione tra Television Show e Colour @it
range: colour
type: ObjectProperty
comment: Relation between Television Show and Colour
domain: television show

has Comedian
comment: Relation between Television Show and Comedian
related match: presenter
related match: director
related match: tvSeriesWrittenBy
type: ObjectProperty
related match: writer
related match: creator
related match: judges
range: comedian
related match: composer
related match: starring
related match: scenicArtDesign
comment: Relazione tra Television Show e Comedian @it
related match: developer
related match: voices
related match: narrated
related match: executiveProducer
related match: aux
related match: producer
related match: winners
domain: television show

has American Football Player
related match: creator
related match: starring
type: ObjectProperty
related match: director
related match: executiveProducer
range: american football player
comment: Relation between Television Show and American Football Player
domain: television show
related match: producer
related match: commentators
related match: presenter
comment: Relazione tra Television Show e American Football Player @it

ski area
label: domaine skiable @fr
type: Class

space station
label: station spatiale @fr
type: Class

non-profit organisation
type: Class
label: organisation à but non lucratif @fr

canadian football league
type: Class

Axiom
matching quantification: 1
annotated target: starring
annotated source: has Astronaut

has Airline
type: ObjectProperty
domain: television show
range: airline
comment: Relation between Television Show and Airline
comment: Relazione tra Television Show e Airline @it

Axiom
annotated source: has Model
matching quantification: 66
annotated target: starring

rugby league
type: Class
label: ligue de rugby @fr

has President
range: president
type: ObjectProperty
comment: Relation between Television Show and President
domain: television show
comment: Relazione tra Television Show e President @it
related match: director

has School
domain: television show
comment: Relazione tra Television Show e School @it
range: school
comment: Relation between Television Show and School
type: ObjectProperty

has Ice Hockey League
domain: television show
type: ObjectProperty
comment: Relation between Television Show and Ice Hockey League
range: ice hockey league
comment: Relazione tra Television Show e Ice Hockey League @it

wine region
label: région viticole @fr
type: Class

weapon
label: arme @fr
type: Class

has Cyclist
related match: director
domain: television show
range: cyclist
comment: Relazione tra Television Show e Cyclist @it
comment: Relation between Television Show and Cyclist
type: ObjectProperty

Axiom
annotated source: has Golf Player
matching quantification: 1
annotated target: starring

has Amphibian
type: ObjectProperty
range: amphibian
comment: Relazione tra Television Show e Amphibian @it
comment: Relation between Television Show and Amphibian
domain: television show

Axiom
annotated source: has Criminal
annotated target: supervisingStoryEd
matching quantification: 1

Axiom
annotated source: has Senator
annotated target: director
matching quantification: 1

has Congressman
related match: starring
related match: voices
type: ObjectProperty
comment: Relation between Television Show and Congressman
range: congressman
comment: Relazione tra Television Show e Congressman @it
domain: television show

has Saint
comment: Relation between Television Show and Saint
comment: Relazione tra Television Show e Saint @it
type: ObjectProperty
domain: television show
range: saint

philosopher
type: Class
label: philosophe @fr

has Tennis Player
comment: Relation between Television Show and Tennis Player
comment: Relazione tra Television Show e Tennis Player @it
range: tennis player
type: ObjectProperty
domain: television show
related match: starring
related match: aux

Axiom
annotated source: has Beverage
matching quantification: 1
annotated target: studios

sport
type: Class

restaurant
type: Class

has Cricketer
type: ObjectProperty
related match: storyEditor
domain: television show
range: cricketer
related match: starring
comment: Relation between Television Show and Cricketer
related match: presenter
related match: aux
comment: Relazione tra Television Show e Cricketer @it

has Adult Actor
related match: judges
related match: presenter
related match: starring
range: adult actor
domain: television show
comment: Relation between Television Show and Adult Actor
comment: Relazione tra Television Show e Adult Actor @it
type: ObjectProperty

nerve
label: nerf @fr
type: Class

Axiom
annotated source: has Soccer Player
annotated target: writtenby
matching quantification: 1

has Volleyball League
range: volleyball league
comment: Relation between Television Show and Volleyball League
comment: Relazione tra Television Show e Volleyball League @it
domain: television show
type: ObjectProperty

has Video Game
comment: Relazione tra Television Show e Video Game @it
domain: television show
comment: Relation between Television Show and Video Game
type: ObjectProperty
range: video game

town
type: Class
label: ville @fr

university
type: Class
label: université @fr
label: πανεπιστήμιο @el

Axiom
annotated source: has Adult Actor
matching quantification: 1
annotated target: presenter

has Lunar Crater
comment: Relation between Television Show and Lunar Crater
domain: television show
comment: Relazione tra Television Show e Lunar Crater @it
range: lunar crater
type: ObjectProperty

auto racing league
type: Class
label: la ligue de course automobile @fr

artery
label: artère @fr
type: Class
label: Arterie @de

has College
comment: Relazione tra Television Show e College @it
range: college
domain: television show
comment: Relation between Television Show and College
type: ObjectProperty

has Canadian Football Team
comment: Relazione tra Television Show e Canadian Football Team @it
type: ObjectProperty
comment: Relation between Television Show and Canadian Football Team
range: canadian football team
domain: television show

hotel
type: Class
label: hôtel @fr

music festival
type: Class
label: festival de musique @fr

has Space Shuttle
comment: Relazione tra Television Show e Space Shuttle @it
type: ObjectProperty
comment: Relation between Television Show and Space Shuttle
range: space shuttle
domain: television show

Axiom
annotated target: judges
annotated source: has Rugby Player
matching quantification: 4

muscle
type: Class

village
label: χωριό @el
type: Class

has University
related match: recorded
range: university
domain: television show
comment: Relazione tra Television Show e University @it
type: ObjectProperty
comment: Relation between Television Show and University

ice hockey league
type: Class
label: ligue d'hockey sur glace @fr

Axiom
annotated source: has Soccer Player
matching quantification: 1
annotated target: judges

Axiom
annotated target: aux
annotated source: has Cricketer
matching quantification: 1

has Canadian Football League
domain: television show
comment: Relazione tra Television Show e Canadian Football League @it
range: canadian football league
type: ObjectProperty
comment: Relation between Television Show and Canadian Football League

has Mollusca
type: ObjectProperty
comment: Relazione tra Television Show e Mollusca @it
comment: Relation between Television Show and Mollusca
domain: television show
range: mollusca

has Mixed Martial Arts Event
domain: television show
range: mixed martial arts event
comment: Relation between Television Show and Mixed Martial Arts Event
comment: Relazione tra Television Show e Mixed Martial Arts Event @it
type: ObjectProperty

office holder
label: Amtsinhaber @de
type: Class
label: titulaire @fr

baseball player
type: Class
label: joueur de baseball @fr

website
label: site web @fr
label: Ιστότοπος @el
type: Class

grape
type: Class
label: raisin @fr

has Beverage
range: beverage
type: ObjectProperty
comment: Relation between Television Show and Beverage
domain: television show
comment: Relazione tra Television Show e Beverage @it
related match: studios

has Fungus
comment: Relation between Television Show and Fungus
type: ObjectProperty
comment: Relazione tra Television Show e Fungus @it
domain: television show
range: fungus

basketball player
type: Class
label: joueur de basketball @fr

adult actor
label: acteur adulte @fr
type: Class
label: erwachsener Schauspieler @de

Axiom
annotated source: has Soccer Player
annotated target: editor
matching quantification: 1

has Disease
comment: Relation between Television Show and Disease
domain: television show
range: disease
comment: Relazione tra Television Show e Disease @it
type: ObjectProperty

ice hockey player
type: Class
label: joueur de hockey sur glace @fr

Axiom
annotated source: has Member Of Parliament
matching quantification: 7
annotated target: starring

has Conifer
range: conifer
domain: television show
comment: Relazione tra Television Show e Conifer @it
comment: Relation between Television Show and Conifer
type: ObjectProperty

Axiom
matching quantification: 1
annotated target: director
annotated source: has Cyclist

beverage
type: Class
label: boisson @fr

has Military Conflict
domain: television show
type: ObjectProperty
comment: Relazione tra Television Show e Military Conflict @it
range: military conflict
comment: Relation between Television Show and Military Conflict

planet
label: planète @fr
type: Class

has Ambassador
type: ObjectProperty
range: ambassador
comment: Relation between Television Show and Ambassador
comment: Relazione tra Television Show e Ambassador @it
domain: television show

has Ship
range: ship
comment: Relazione tra Television Show e Ship @it
domain: television show
type: ObjectProperty
comment: Relation between Television Show and Ship

scientist
type: Class
label: Wissenschaftler @de
label: scientifique @fr

has Baseball League
range: baseball league
domain: television show
comment: Relazione tra Television Show e Baseball League @it
comment: Relation between Television Show and Baseball League
type: ObjectProperty

golf league
type: Class
label: ligue de golf @fr

has Monarch
type: ObjectProperty
range: monarch
comment: Relazione tra Television Show e Monarch @it
domain: television show
comment: Relation between Television Show and Monarch

Axiom
annotated source: has Office Holder
matching quantification: 1
annotated target: director

olympics
type: Class
label: Jeux Olympiques @fr

has Philosopher
type: ObjectProperty
comment: Relazione tra Television Show e Philosopher @it
domain: television show
range: philosopher
comment: Relation between Television Show and Philosopher

Axiom
annotated source: has Gaelic Games Player
matching quantification: 1
annotated target: presenter

bridge
type: Class
label: pont @fr

has Skyscraper
comment: Relazione tra Television Show e Skyscraper @it
domain: television show
comment: Relation between Television Show and Skyscraper
range: skyscraper
type: ObjectProperty

has Basketball League
range: basketball league
domain: television show
comment: Relation between Television Show and Basketball League
comment: Relazione tra Television Show e Basketball League @it
type: ObjectProperty

has Convention
domain: television show
comment: Relation between Television Show and Convention
type: ObjectProperty
range: convention
comment: Relazione tra Television Show e Convention @it

vein
type: Class
label: veine @fr

island
type: Class
label: νησί @el
label: île @fr

comics character
label: personnage de bandes dessinées @fr
type: Class

Formula One racer
type: Class
label: pilote de formule 1 @fr

skyscraper
label: gratte-ciel @fr
type: Class

has Mixed Martial Arts League
comment: Relazione tra Television Show e Mixed Martial Arts League @it
range: mixed martial arts league
domain: television show
comment: Relation between Television Show and Mixed Martial Arts League
type: ObjectProperty

Axiom
matching quantification: 11
annotated target: director
annotated source: has Comedian

radio station
type: Class
label: station de radio @fr

member of parliament
label: membre du Parlement @fr
type: Class

bone
type: Class
label: Knochen @de
label: os @fr

airport
type: Class
label: Flughafen @de
label: aéroport @fr

conifer
label: conifères @fr
type: Class

Axiom
annotated source: has Comedian
matching quantification: 38
annotated target: voices

has Mountain
comment: Relation between Television Show and Mountain
domain: television show
comment: Relazione tra Television Show e Mountain @it
range: mountain
type: ObjectProperty

Axiom
matching quantification: 3
annotated target: developer
annotated source: has Comics Creator

has Musical
comment: Relation between Television Show and Musical
type: ObjectProperty
comment: Relazione tra Television Show e Musical @it
range: musical
domain: television show

Axiom
annotated source: has Website
matching quantification: 1
annotated target: channel

rocket
label: fusée @fr
type: Class

Axiom
matching quantification: 10
annotated target: presenter
annotated source: has Model

disease
type: Class
label: maladie @fr

has Rugby League
type: ObjectProperty
range: rugby league
comment: Relazione tra Television Show e Rugby League @it
comment: Relation between Television Show and Rugby League
domain: television show

Axiom
matching quantification: 1
annotated source: has President
annotated target: director

has Magazine
type: ObjectProperty
comment: Relazione tra Television Show e Magazine @it
comment: Relation between Television Show and Magazine
range: magazine
domain: television show
related match: starring

has Single
comment: Relation between Television Show and Single
range: single
domain: television show
comment: Relazione tra Television Show e Single @it
type: ObjectProperty
related match: opentheme

has Basketball Team
domain: television show
range: basketball team
comment: Relazione tra Television Show e Basketball Team @it
type: ObjectProperty
comment: Relation between Television Show and Basketball Team

has Town
related match: location
type: ObjectProperty
comment: Relation between Television Show and Town
comment: Relazione tra Television Show e Town @it
domain: television show
range: town

has Mayor
comment: Relation between Television Show and Mayor
range: mayor
domain: television show
type: ObjectProperty
comment: Relazione tra Television Show e Mayor @it

american football player
type: Class
label: joueur de football américain @fr

stadium
label: stade @fr
type: Class

has Sport
range: sport
comment: Relation between Television Show and Sport
type: ObjectProperty
comment: Relazione tra Television Show e Sport @it
domain: television show
related match: format

has Island
comment: Relazione tra Television Show e Island @it
domain: television show
range: island
comment: Relation between Television Show and Island
type: ObjectProperty
related match: location

astronaut
label: astronaute @fr
label: Astronaut @de
type: Class

videogames league
type: Class
label: ligue de jeux vidéo @fr

Axiom
annotated source: has College Coach
annotated target: creator percent 28s percent 29
matching quantification: 1

has Astronaut
type: ObjectProperty
domain: television show
range: astronaut
comment: Relation between Television Show and Astronaut
comment: Relazione tra Television Show e Astronaut @it
related match: starring

Axiom
annotated target: starring
annotated source: has Soccer Manager
matching quantification: 3

Axiom
annotated source: has Office Holder
matching quantification: 2
annotated target: voices

has Drug
comment: Relation between Television Show and Drug
range: drug
comment: Relazione tra Television Show e Drug @it
type: ObjectProperty
domain: television show

Site of Special Scientific Interest
label: site d'intérêt scientifique particulier @fr
type: Class

Axiom
matching quantification: 1
annotated source: has Office Holder
annotated target: themeMusicComposer

mayor
label: maire @fr
type: Class

amphibian
type: Class
label: amphibien @fr

has Non- Profit Organisation
domain: television show
type: ObjectProperty
range: non-profit organisation
comment: Relazione tra Television Show e Non- Profit Organisation @it
comment: Relation between Television Show and Non- Profit Organisation

has Grape
comment: Relazione tra Television Show e Grape @it
comment: Relation between Television Show and Grape
range: grape
type: ObjectProperty
domain: television show

pope
label: pape @fr
type: Class

has Television Episode
related match: executiveProducer
comment: Relation between Television Show and Television Episode
comment: Relazione tra Television Show e Television Episode @it
domain: television show
type: ObjectProperty
range: television episode

has Bridge
comment: Relazione tra Television Show e Bridge @it
range: bridge
type: ObjectProperty
comment: Relation between Television Show and Bridge
domain: television show

newspaper
type: Class
label: journal @fr

protected area
type: Class
label: προστατευμένη περιοχή @el
label: aire protégée @fr

game
label: jeu @fr
type: Class

Axiom
matching quantification: 6
annotated target: location
annotated source: has Town

Axiom
annotated source: has Record Label
annotated target: distributor
matching quantification: 1

has Ice Hockey Player
comment: Relation between Television Show and Ice Hockey Player
comment: Relazione tra Television Show e Ice Hockey Player @it
related match: voices
related match: starring
type: ObjectProperty
related match: presenter
related match: writer
domain: television show
related match: director
related match: cameras
range: ice hockey player

Axiom
annotated target: producer
annotated source: has Soccer Player
matching quantification: 1

has Election
comment: Relazione tra Television Show e Election @it
comment: Relation between Television Show and Election
type: ObjectProperty
domain: television show
range: Election

Axiom
annotated source: has Journalist
annotated target: presenter
matching quantification: 132

has Airport
comment: Relation between Television Show and Airport
comment: Relazione tra Television Show e Airport @it
type: ObjectProperty
range: airport
domain: television show
related match: location

tennis league
type: Class
label: ligue de tennis @fr

has Crustacean
domain: television show
comment: Relation between Television Show and Crustacean
comment: Relazione tra Television Show e Crustacean @it
type: ObjectProperty
range: crustacean

has Historic Building
domain: television show
comment: Relazione tra Television Show e Historic Building @it
comment: Relation between Television Show and Historic Building
range: historic building
type: ObjectProperty

river
type: Class
label: rivière @fr

Axiom
annotated source: has Figure Skater
annotated target: starring
matching quantification: 2

Axiom
matching quantification: 7
annotated target: creator
annotated source: has Wrestler

has River
range: river
comment: Relation between Television Show and River
comment: Relazione tra Television Show e River @it
type: ObjectProperty
domain: television show

school
type: Class
label: école @fr

museum
label: musée @fr
type: Class

video game
label: jeux vidéo @fr
type: Class

has Cave
range: cave
domain: television show
type: ObjectProperty
comment: Relazione tra Television Show e Cave @it
comment: Relation between Television Show and Cave

trade union
label: syndicat professionnel @fr
type: Class

Axiom
matching quantification: 1
annotated source: has Soccer Manager
annotated target: director

Axiom
annotated source: has Island
annotated target: location
matching quantification: 5

currency
label: devise @fr
type: Class

Axiom
matching quantification: 3
annotated source: has Comedian
annotated target: winners

British royalty
type: Class
label: royauté Britannique @fr

has Comics Character
comment: Relation between Television Show and Comics Character
range: comics character
domain: television show
type: ObjectProperty
comment: Relazione tra Television Show e Comics Character @it

historic place
label: site historique @fr
type: Class

monument
type: Class

has Governor
domain: television show
comment: Relation between Television Show and Governor
range: governor
type: ObjectProperty
comment: Relazione tra Television Show e Governor @it

has Protected Area
type: ObjectProperty
range: protected area
comment: Relation between Television Show and Protected Area
comment: Relazione tra Television Show e Protected Area @it
domain: television show

continent
label: ήπειρος @el
type: Class

Axiom
matching quantification: 2
annotated target: aux
annotated source: has Tennis Player

Axiom
annotated target: director
annotated source: has Ice Hockey Player
matching quantification: 2

has Formula One Racer
related match: starring
related match: presenter
comment: Relation between Television Show and Formula One Racer
type: ObjectProperty
comment: Relazione tra Television Show e Formula One Racer @it
range: Formula One racer
domain: television show

figure skater
type: Class
label: patineur artistique @fr

has Shopping Mall
range: shopping mall
comment: Relazione tra Television Show e Shopping Mall @it
domain: television show
type: ObjectProperty
comment: Relation between Television Show and Shopping Mall

Axiom
annotated source: has Adult Actor
annotated target: starring
matching quantification: 20

has British Royalty
domain: television show
comment: Relazione tra Television Show e British Royalty @it
range: British royalty
comment: Relation between Television Show and British Royalty
type: ObjectProperty

has Eurovision Song Contest Entry
domain: television show
type: ObjectProperty
comment: Relazione tra Television Show e Eurovision Song Contest Entry @it
range: Eurovision song contest entry
comment: Relation between Television Show and Eurovision Song Contest Entry

has Nerve
type: ObjectProperty
comment: Relazione tra Television Show e Nerve @it
domain: television show
comment: Relation between Television Show and Nerve
range: nerve

Axiom
annotated source: has Comedian
matching quantification: 2
annotated target: developer

canadian football team
label: équipe canadienne de football américain @fr
type: Class

music genre
type: Class
label: género musical @pt
label: genre musical @fr

Axiom
annotated source: has Comics Creator
annotated target: starring
matching quantification: 3

Axiom
annotated source: has American Football Player
annotated target: executiveProducer
matching quantification: 2

record label
type: Class
label: label discographique @fr

architect
type: Class
label: architecte @fr

model
type: Class
label: mannequin @fr

Axiom
annotated source: has Member Of Parliament
annotated target: creator
matching quantification: 1

Axiom
matching quantification: 3
annotated target: writer
annotated source: has Office Holder

ambassador
label: ambassadeur @fr
type: Class

has Currency
domain: television show
comment: Relazione tra Television Show e Currency @it
type: ObjectProperty
comment: Relation between Television Show and Currency
range: currency

Axiom
annotated source: has Comedian
annotated target: producer
matching quantification: 1

has Game
type: ObjectProperty
comment: Relation between Television Show and Game
comment: Relazione tra Television Show e Game @it
domain: television show
range: game

Axiom
annotated source: has Soccer Player
matching quantification: 3
annotated target: voices

Axiom
matching quantification: 1
annotated source: has Cricketer
annotated target: storyEditor

Axiom
matching quantification: 3
annotated source: has Historic Place
annotated target: location

has Automobile
related match: aux
domain: television show
type: ObjectProperty
comment: Relation between Television Show and Automobile
comment: Relazione tra Television Show e Automobile @it
range: automobile

has Launch Pad
comment: Relation between Television Show and Launch Pad
comment: Relazione tra Television Show e Launch Pad @it
domain: television show
range: launch pad
type: ObjectProperty

Grand Prix
label: grand prix @fr
type: Class

chancellor
type: Class
label: chancelier @fr

comics creator
type: Class
label: créateur de bandes dessinées @fr

Axiom
annotated source: has Soccer Player
matching quantification: 24
annotated target: starring

has Park
domain: television show
comment: Relazione tra Television Show e Park @it
comment: Relation between Television Show and Park
type: ObjectProperty
range: park

has Auto Racing League
comment: Relazione tra Television Show e Auto Racing League @it
domain: television show
range: auto racing league
comment: Relation between Television Show and Auto Racing League
type: ObjectProperty

hockey team
label: équipe de hockey @fr
type: Class

soccer player
type: Class
label: joueur de football @fr

Axiom
annotated source: has Ice Hockey Player
matching quantification: 1
annotated target: voices

reptile
type: Class

has Soccer League
domain: television show
type: ObjectProperty
range: soccer league
comment: Relazione tra Television Show e Soccer League @it
comment: Relation between Television Show and Soccer League

Axiom
annotated target: location
annotated source: has Stadium
matching quantification: 1

cave
type: Class
label: grotte @fr

Axiom
matching quantification: 1
annotated target: starring
annotated source: has Prime Minister

congressman
label: membre du Congrès @fr
type: Class

Axiom
matching quantification: 4
annotated source: has Comedian
annotated target: judges

has Womens Tennis Association Tournament
domain: television show
type: ObjectProperty
comment: Relation between Television Show and Womens Tennis Association Tournament
range: Women's Tennis Association tournament
comment: Relazione tra Television Show e Womens Tennis Association Tournament @it

journalist
label: journaliste @fr
type: Class

Axiom
matching quantification: 1
annotated target: executiveProducer
annotated source: has Television Episode

has Golf Player
domain: television show
type: ObjectProperty
range: golf player
comment: Relation between Television Show and Golf Player
comment: Relazione tra Television Show e Golf Player @it
related match: starring

Axiom
annotated source: has Comedian
matching quantification: 61
annotated target: creator

has National Collegiate Athletic Association Athlete
comment: Relation between Television Show and National Collegiate Athletic Association Athlete
comment: Relazione tra Television Show e National Collegiate Athletic Association Athlete @it
domain: television show
type: ObjectProperty
range: national collegiate athletic association athlete

mixed martial arts league
label: ligue d'arts martiaux mixtes @fr
type: Class

Axiom
matching quantification: 1
annotated target: scenicArtDesign
annotated source: has Comedian

american football team
type: Class
label: équipe américaine de football américain @fr

Axiom
matching quantification: 4
annotated target: voices
annotated source: has Comics Creator

Axiom
annotated target: voices
annotated source: has Soccer Manager
matching quantification: 3

has Comics Creator
type: ObjectProperty
related match: createdBy
comment: Relazione tra Television Show e Comics Creator @it
domain: television show
related match: creator
related match: producer
related match: writer
related match: executiveProducer
related match: company
related match: voices
comment: Relation between Television Show and Comics Creator
range: comics creator
related match: developer
related match: starring

chemical compound
label: produit chimique @fr
type: Class

bird
type: Class
label: oiseau @fr

power station
type: Class

Axiom
annotated source: has Model
matching quantification: 17
annotated target: judges

fern
label: fougères @fr
type: Class

has Music Genre
type: ObjectProperty
comment: Relation between Television Show and Music Genre
range: music genre
domain: television show
comment: Relazione tra Television Show e Music Genre @it

Axiom
annotated target: executiveProducer
matching quantification: 1
annotated source: has College Coach

Axiom
matching quantification: 2
annotated target: before
annotated source: has Journalist

has Cycad
domain: television show
comment: Relazione tra Television Show e Cycad @it
type: ObjectProperty
range: cycad
comment: Relation between Television Show and Cycad

Axiom
annotated source: has Criminal
annotated target: writer
matching quantification: 1

Axiom
annotated source: has Basketball Player
matching quantification: 10
annotated target: starring

Axiom
annotated source: has Model
matching quantification: 1
annotated target: voices

has Brain
domain: television show
comment: Relazione tra Television Show e Brain @it
range: brain
comment: Relation between Television Show and Brain
type: ObjectProperty

Axiom
annotated source: has Office Holder
annotated target: starring
matching quantification: 21

musical
label: musique @fr
type: Class

Axiom
annotated target: storyEditor
annotated source: has Soccer Player
matching quantification: 1

Axiom
annotated source: has Book
annotated target: related
matching quantification: 1

Axiom
matching quantification: 6
annotated source: has Ice Hockey Player
annotated target: presenter

has Space Mission
comment: Relation between Television Show and Space Mission
range: space mission
comment: Relazione tra Television Show e Space Mission @it
type: ObjectProperty
domain: television show

has Stadium
comment: Relazione tra Television Show e Stadium @it
type: ObjectProperty
range: stadium
comment: Relation between Television Show and Stadium
domain: television show
related match: location

has Muscle
domain: television show
comment: Relazione tra Television Show e Muscle @it
range: muscle
comment: Relation between Television Show and Muscle
type: ObjectProperty

Axiom
annotated source: has Office Holder
matching quantification: 1
annotated target: presenter

Axiom
annotated target: director
annotated source: has American Football Player
matching quantification: 1

has Basketball Player
comment: Relazione tra Television Show e Basketball Player @it
domain: television show
comment: Relation between Television Show and Basketball Player
range: basketball player
type: ObjectProperty
related match: starring
related match: judges

mountain
type: Class
label: montagne @fr
label: Βουνό @el

criminal
type: Class
label: criminel @fr

space shuttle
type: Class
label: navette spatiale @fr

Axiom
matching quantification: 4
annotated target: pundits
annotated source: has Soccer Player

Axiom
annotated target: creator
matching quantification: 1
annotated source: has Poker Player

has Monument
domain: television show
comment: Relazione tra Television Show e Monument @it
range: monument
type: ObjectProperty
comment: Relation between Television Show and Monument

Axiom
matching quantification: 3
annotated source: has Journalist
annotated target: executiveProducer

Axiom
annotated target: presenter
annotated source: has Member Of Parliament
matching quantification: 2

comedian
type: Class
label: comédien @fr

has Race
comment: Relazione tra Television Show e Race @it
type: ObjectProperty
range: race
comment: Relation between Television Show and Race
domain: television show

has Chancellor
range: chancellor
comment: Relation between Television Show and Chancellor
type: ObjectProperty
comment: Relazione tra Television Show e Chancellor @it
domain: television show

has Station
comment: Relazione tra Television Show e Station @it
domain: television show
range: station
type: ObjectProperty
comment: Relation between Television Show and Station

Axiom
annotated target: writer
matching quantification: 1
annotated source: has Member Of Parliament

green alga
label: algue verte @fr
type: Class

Playboy Playmate
label: playmate pour Playboy @fr
type: Class

has Artery
type: ObjectProperty
comment: Relation between Television Show and Artery
domain: television show
comment: Relazione tra Television Show e Artery @it
range: artery

Axiom
annotated source: has Baseball Player
annotated target: judges
matching quantification: 1

has Wine Region
domain: television show
comment: Relazione tra Television Show e Wine Region @it
comment: Relation between Television Show and Wine Region
type: ObjectProperty
range: wine region

has Arachnid
comment: Relazione tra Television Show e Arachnid @it
range: arachnid
comment: Relation between Television Show and Arachnid
type: ObjectProperty
domain: television show

has Rugby Player
comment: Relation between Television Show and Rugby Player
type: ObjectProperty
related match: starring
related match: presenter
related match: writer
range: rugby player
related match: judges
related match: executiveProducer
comment: Relazione tra Television Show e Rugby Player @it
domain: television show

Axiom
matching quantification: 1
annotated target: composer
annotated source: has Comedian

Axiom
annotated source: has Comedian
matching quantification: 424
annotated target: starring

bacteria
type: Class
label: bactérie @fr

Axiom
matching quantification: 1
annotated target: presenter
annotated source: has Formula One Racer

has Figure Skater
related match: judges
related match: voices
related match: starring
type: ObjectProperty
range: figure skater
comment: Relation between Television Show and Figure Skater
domain: television show
comment: Relazione tra Television Show e Figure Skater @it

Axiom
matching quantification: 1
annotated source: has Magazine
annotated target: starring

Axiom
matching quantification: 1
annotated source: has Poker Player
annotated target: director

mollusca
label: mollusque @fr
type: Class

Axiom
annotated target: network
matching quantification: 3
annotated source: has Website

Axiom
annotated target: writer
matching quantification: 14
annotated source: has Comics Creator

has Soccer Manager
related match: starring
related match: director
related match: voices
comment: Relazione tra Television Show e Soccer Manager @it
domain: television show
range: soccer manager
comment: Relation between Television Show and Soccer Manager
type: ObjectProperty

Axiom
annotated target: starring
matching quantification: 6
annotated source: has College Coach

Axiom
annotated target: producer
matching quantification: 1
annotated source: has Comics Creator

drug
label: médicament @fr
type: Class

Axiom
annotated source: has Village
annotated target: location
matching quantification: 1

magazine
type: Class
label: περιοδικό @el

Axiom
matching quantification: 51
annotated target: creator
annotated source: has Comics Creator

Axiom
annotated source: has Congressman
matching quantification: 1
annotated target: voices

canal
type: Class

military person
label: militaire @fr
type: Class

has American Football Team
range: american football team
type: ObjectProperty
comment: Relazione tra Television Show e American Football Team @it
comment: Relation between Television Show and American Football Team
domain: television show

award
type: Class
label: récompense @fr

has Tennis League
comment: Relazione tra Television Show e Tennis League @it
domain: television show
comment: Relation between Television Show and Tennis League
type: ObjectProperty
range: tennis league

Axiom
annotated source: has Comedian
matching quantification: 8
annotated target: aux

locomotive
type: Class

college
type: Class

has Pope
type: ObjectProperty
range: pope
comment: Relation between Television Show and Pope
domain: television show
comment: Relazione tra Television Show e Pope @it

Axiom
annotated target: starring
annotated source: has Nascar Driver
matching quantification: 4

cricketer
type: Class
label: joueur de cricket @fr

Axiom
annotated source: has Comedian
annotated target: narrated
matching quantification: 2

single
type: Class

Axiom
annotated target: creator
matching quantification: 3
annotated source: has Journalist

mixed martial arts event
type: Class
label: évènement d'arts martiaux mixtes @fr

Axiom
annotated source: has Architect
annotated target: starring
matching quantification: 1

Axiom
annotated target: starring
annotated source: has Rugby Player
matching quantification: 6

ethnic group
type: Class
label: groupe ethnique @fr

Axiom
annotated source: has Mammal
matching quantification: 1
annotated target: network

embryology
label: embryologie @fr
type: Class

has Historic Place
range: historic place
comment: Relazione tra Television Show e Historic Place @it
type: ObjectProperty
comment: Relation between Television Show and Historic Place
domain: television show
related match: location

Axiom
annotated target: starring
annotated source: has Playboy Playmate
matching quantification: 10

has Bone
range: bone
type: ObjectProperty
comment: Relazione tra Television Show e Bone @it
domain: television show
comment: Relation between Television Show and Bone

Axiom
matching quantification: 69
annotated target: starring
annotated source: has Journalist

Axiom
annotated source: has Tennis Player
annotated target: starring
matching quantification: 2

Axiom
annotated target: writer
annotated source: has Rugby Player
matching quantification: 1

volleyball league
label: ligue de volleyball @fr
type: Class

has Grand Prix
comment: Relation between Television Show and Grand Prix
range: Grand Prix
type: ObjectProperty
comment: Relazione tra Television Show e Grand Prix @it
domain: television show

college coach
label: entraîneur universitaire @fr
type: Class

has American Football League
domain: television show
range: american football league
type: ObjectProperty
comment: Relazione tra Television Show e American Football League @it
comment: Relation between Television Show and American Football League

television episode
type: Class
label: épisode télévisé @fr

Axiom
matching quantification: 7
annotated target: starring
annotated source: has Poker Player

soccer club
label: club de football @fr
type: Class

Axiom
annotated target: developer
matching quantification: 1
annotated source: has Wrestler

has Fern
range: fern
type: ObjectProperty
comment: Relazione tra Television Show e Fern @it
comment: Relation between Television Show and Fern
domain: television show

Axiom
annotated source: has Wrestler
matching quantification: 2
annotated target: executiveProducer

historic building
type: Class
label: bâtiment historique @fr

military conflict
label: conflit militaire @fr
type: Class

has Office Holder
related match: director
comment: Relazione tra Television Show e Office Holder @it
range: office holder
related match: voices
domain: television show
related match: themeMusicComposer
related match: presenter
related match: starring
related match: writer
related match: producer
related match: executiveProducer
related match: createdBy
type: ObjectProperty
comment: Relation between Television Show and Office Holder

Axiom
annotated target: presenter
matching quantification: 7
annotated source: has Soccer Player

Axiom
matching quantification: 1
annotated target: starring
annotated source: has Congressman

has Hospital
type: ObjectProperty
comment: Relazione tra Television Show e Hospital @it
range: hospital
domain: television show
comment: Relation between Television Show and Hospital

launch pad
label: rampe de lancement @fr
type: Class

Axiom
annotated target: executiveProducer
annotated source: has Office Holder
matching quantification: 3

has Olympics
comment: Relazione tra Television Show e Olympics @it
type: ObjectProperty
range: olympics
domain: television show
comment: Relation between Television Show and Olympics

has Criminal
type: ObjectProperty
comment: Relazione tra Television Show e Criminal @it
domain: television show
comment: Relation between Television Show and Criminal
range: criminal
related match: creator
related match: supervisingStoryEd
related match: writer

Axiom
annotated source: has Wrestler
annotated target: producer
matching quantification: 5

Christian Bishop
label: évêque chrétien @fr
type: Class

Axiom
matching quantification: 1
annotated target: voices
annotated source: has Boxer

mountain range
label: chaîne de montagne @fr
type: Class

Axiom
annotated source: has University
annotated target: recorded
matching quantification: 1

Axiom
matching quantification: 1
annotated target: writer
annotated source: has Ice Hockey Player

Axiom
annotated source: has Soccer Player
annotated target: creator
matching quantification: 2

has Supreme Court Of The United States Case
type: ObjectProperty
comment: Relation between Television Show and Supreme Court Of The United States Case
domain: television show
comment: Relazione tra Television Show e Supreme Court Of The United States Case @it
range: Supreme Court of the United States case

Axiom
matching quantification: 25
annotated source: has Comedian
annotated target: writer

has Site Of Special Scientific Interest
comment: Relation between Television Show and Site Of Special Scientific Interest
domain: television show
comment: Relazione tra Television Show e Site Of Special Scientific Interest @it
range: Site of Special Scientific Interest
type: ObjectProperty

Axiom
annotated target: starring
matching quantification: 2
annotated source: has Formula One Racer

Axiom
annotated source: has Soccer Player
matching quantification: 1
annotated target: executiveProducer

has Lighthouse
domain: television show
comment: Relation between Television Show and Lighthouse
range: lighthouse
type: ObjectProperty
comment: Relazione tra Television Show e Lighthouse @it

badminton player
type: Class
label: joueur de badminton @fr

Axiom
annotated target: presenter
annotated source: has Rugby Player
matching quantification: 4

baseball league
type: Class
label: ligue de baseball @fr

has Continent
type: ObjectProperty
comment: Relazione tra Television Show e Continent @it
domain: television show
range: continent
comment: Relation between Television Show and Continent

Axiom
annotated source: has Office Holder
matching quantification: 1
annotated target: createdBy

has Power Station
type: ObjectProperty
range: power station
comment: Relazione tra Television Show e Power Station @it
domain: television show
comment: Relation between Television Show and Power Station

has Website
related match: network
related match: channel
range: website
comment: Relazione tra Television Show e Website @it
domain: television show
comment: Relation between Television Show and Website
type: ObjectProperty

Axiom
annotated target: producer
annotated source: has American Football Player
matching quantification: 1

has Christian Bishop
range: Christian Bishop
type: ObjectProperty
domain: television show
comment: Relazione tra Television Show e Christian Bishop @it
comment: Relation between Television Show and Christian Bishop

has Golf League
range: golf league
comment: Relazione tra Television Show e Golf League @it
domain: television show
comment: Relation between Television Show and Golf League
type: ObjectProperty

has Film Festival
comment: Relation between Television Show and Film Festival
domain: television show
range: film festival
type: ObjectProperty
comment: Relazione tra Television Show e Film Festival @it

mammal
type: Class
label: mammifère @fr

has Badminton Player
range: badminton player
comment: Relation between Television Show and Badminton Player
domain: television show
type: ObjectProperty
comment: Relazione tra Television Show e Badminton Player @it

Eurovision song contest entry
type: Class
label: concours Eurovision de la chanson @fr

has Military Person
related match: creator
related match: writer
related match: starring
domain: television show
range: military person
comment: Relazione tra Television Show e Military Person @it
comment: Relation between Television Show and Military Person
type: ObjectProperty

has Restaurant
comment: Relation between Television Show and Restaurant
domain: television show
type: ObjectProperty
comment: Relazione tra Television Show e Restaurant @it
range: restaurant

has Bacteria
comment: Relazione tra Television Show e Bacteria @it
type: ObjectProperty
domain: television show
comment: Relation between Television Show and Bacteria
range: bacteria

has Record Label
domain: television show
range: record label
comment: Relation between Television Show and Record Label
comment: Relazione tra Television Show e Record Label @it
type: ObjectProperty
related match: distributor

Axiom
matching quantification: 1
annotated source: has Baseball Player
annotated target: director

has Member Of Parliament
related match: presenter
range: member of parliament
related match: starring
related match: creator
type: ObjectProperty
comment: Relazione tra Television Show e Member Of Parliament @it
related match: writer
domain: television show
comment: Relation between Television Show and Member Of Parliament
related match: voices

Axiom
annotated source: has Basketball Player
annotated target: judges
matching quantification: 1

has Album
comment: Relation between Television Show and Album
type: ObjectProperty
range: album
domain: television show
comment: Relazione tra Television Show e Album @it

has Moss
type: ObjectProperty
domain: television show
comment: Relation between Television Show and Moss
comment: Relazione tra Television Show e Moss @it
range: moss