has Fungus
range: fungus
comment: Relation between Video Game and Fungus
type: ObjectProperty
domain: video game
comment: Relazione tra Video Game e Fungus @it

has Formula One Racer
range: Formula One racer
domain: video game
comment: Relation between Video Game and Formula One Racer
type: ObjectProperty
comment: Relazione tra Video Game e Formula One Racer @it

television show
label: émission de télévision @fr
type: Class

rocket
label: fusée @fr
type: Class

disease
type: Class
label: maladie @fr

has Fern
domain: video game
type: ObjectProperty
comment: Relation between Video Game and Fern
range: fern
comment: Relazione tra Video Game e Fern @it

has Single
comment: Relazione tra Video Game e Single @it
comment: Relation between Video Game and Single
range: single
domain: video game
type: ObjectProperty

automobile
type: Class

colour
label: χρώμα @el
label: couleur @fr
type: Class

has Stadium
comment: Relazione tra Video Game e Stadium @it
range: stadium
domain: video game
type: ObjectProperty
comment: Relation between Video Game and Stadium

has Ship
type: ObjectProperty
comment: Relation between Video Game and Ship
range: ship
domain: video game
comment: Relazione tra Video Game e Ship @it

has Bridge
comment: Relazione tra Video Game e Bridge @it
type: ObjectProperty
domain: video game
comment: Relation between Video Game and Bridge
range: bridge

Election
type: Class
label: élection @fr

has Chemical Compound
domain: video game
comment: Relation between Video Game and Chemical Compound
type: ObjectProperty
range: chemical compound
comment: Relazione tra Video Game e Chemical Compound @it

has Comics Character
range: comics character
comment: Relation between Video Game and Comics Character
domain: video game
type: ObjectProperty
comment: Relazione tra Video Game e Comics Character @it

american football player
type: Class
label: joueur de football américain @fr

has Record Label
comment: Relazione tra Video Game e Record Label @it
type: ObjectProperty
domain: video game
comment: Relation between Video Game and Record Label
range: record label

stadium
label: stade @fr
type: Class

has Judge
type: ObjectProperty
domain: video game
comment: Relation between Video Game and Judge
comment: Relazione tra Video Game e Judge @it
range: judge

soccer league
label: ligue de football @fr
type: Class

astronaut
type: Class
label: Astronaut @de
label: astronaute @fr

has Ethnic Group
comment: Relation between Video Game and Ethnic Group
comment: Relazione tra Video Game e Ethnic Group @it
range: ethnic group
domain: video game
type: ObjectProperty

videogames league
label: ligue de jeux vidéo @fr
type: Class

has Baseball Player
comment: Relation between Video Game and Baseball Player
range: baseball player
comment: Relazione tra Video Game e Baseball Player @it
domain: video game
type: ObjectProperty
related match: programming

has President
range: president
comment: Relazione tra Video Game e President @it
type: ObjectProperty
domain: video game
comment: Relation between Video Game and President

has Hotel
comment: Relazione tra Video Game e Hotel @it
comment: Relation between Video Game and Hotel
range: hotel
type: ObjectProperty
domain: video game

has Fish
comment: Relazione tra Video Game e Fish @it
range: fish
comment: Relation between Video Game and Fish
type: ObjectProperty
domain: video game

has School
comment: Relazione tra Video Game e School @it
type: ObjectProperty
range: school
comment: Relation between Video Game and School
domain: video game

wrestler
label: lutteur @fr
type: Class

has Brain
comment: Relazione tra Video Game e Brain @it
domain: video game
type: ObjectProperty
comment: Relation between Video Game and Brain
range: brain

amphibian
label: amphibien @fr
type: Class

has Valley
comment: Relation between Video Game and Valley
range: valley
comment: Relazione tra Video Game e Valley @it
domain: video game
type: ObjectProperty

pope
type: Class
label: pape @fr

has Disease
comment: Relazione tra Video Game e Disease @it
type: ObjectProperty
range: disease
domain: video game
comment: Relation between Video Game and Disease

has World Heritage Site
range: World Heritage Site
comment: Relation between Video Game and World Heritage Site
comment: Relazione tra Video Game e World Heritage Site @it
domain: video game
type: ObjectProperty

has Crustacean
domain: video game
range: crustacean
type: ObjectProperty
comment: Relazione tra Video Game e Crustacean @it
comment: Relation between Video Game and Crustacean

has Playboy Playmate
comment: Relation between Video Game and Playboy Playmate
domain: video game
comment: Relazione tra Video Game e Playboy Playmate @it
type: ObjectProperty
range: Playboy Playmate

has Baseball League
comment: Relation between Video Game and Baseball League
domain: video game
type: ObjectProperty
range: baseball league
comment: Relazione tra Video Game e Baseball League @it

newspaper
type: Class
label: journal @fr

has Journalist
domain: video game
range: journalist
type: ObjectProperty
comment: Relation between Video Game and Journalist
comment: Relazione tra Video Game e Journalist @it

protected area
label: aire protégée @fr
label: προστατευμένη περιοχή @el
type: Class

game
type: Class
label: jeu @fr

road
type: Class
label: route @fr

ginkgo
type: Class

boxer
label: boxeur @fr
type: Class

judge
label: juge @fr
type: Class

has Airport
comment: Relation between Video Game and Airport
range: airport
comment: Relazione tra Video Game e Airport @it
type: ObjectProperty
domain: video game

World Heritage Site
label: site du patrimoine mondial @fr
type: Class

has Boxer
range: boxer
domain: video game
type: ObjectProperty
comment: Relazione tra Video Game e Boxer @it
comment: Relation between Video Game and Boxer

has Trade Union
comment: Relation between Video Game and Trade Union
range: trade union
type: ObjectProperty
comment: Relazione tra Video Game e Trade Union @it
domain: video game

language
type: Class
label: langage @fr

station
type: Class

has Nascar Driver
domain: video game
type: ObjectProperty
comment: Relazione tra Video Game e Nascar Driver @it
comment: Relation between Video Game and Nascar Driver
range: nascar driver

has Cricketer
comment: Relation between Video Game and Cricketer
type: ObjectProperty
domain: video game
comment: Relazione tra Video Game e Cricketer @it
range: cricketer

has Member Of Parliament
type: ObjectProperty
range: member of parliament
domain: video game
comment: Relation between Video Game and Member Of Parliament
comment: Relazione tra Video Game e Member Of Parliament @it

has Astronaut
range: astronaut
comment: Relation between Video Game and Astronaut
comment: Relazione tra Video Game e Astronaut @it
domain: video game
type: ObjectProperty

lake
type: Class
label: lac @fr

has Automobile
type: ObjectProperty
comment: Relazione tra Video Game e Automobile @it
comment: Relation between Video Game and Automobile
range: automobile
domain: video game

has Military Conflict
related match: genre
comment: Relazione tra Video Game e Military Conflict @it
comment: Relation between Video Game and Military Conflict
type: ObjectProperty
range: military conflict
domain: video game

has Legislature
comment: Relation between Video Game and Legislature
comment: Relazione tra Video Game e Legislature @it
type: ObjectProperty
domain: video game
range: legislature

arachnid
type: Class
label: arachnides @fr

governor
type: Class
label: gouverneur @fr

has Administrative Region
comment: Relation between Video Game and Administrative Region
comment: Relazione tra Video Game e Administrative Region @it
range: administrative region
domain: video game
type: ObjectProperty

administrative region
label: région administrative @fr
type: Class

has Cyclist
domain: video game
type: ObjectProperty
comment: Relazione tra Video Game e Cyclist @it
range: cyclist
comment: Relation between Video Game and Cyclist

has Ice Hockey League
range: ice hockey league
domain: video game
type: ObjectProperty
comment: Relation between Video Game and Ice Hockey League
comment: Relazione tra Video Game e Ice Hockey League @it

poker player
type: Class
label: joueur de poker @fr

river
label: rivière @fr
type: Class

has Senator
comment: Relazione tra Video Game e Senator @it
domain: video game
type: ObjectProperty
range: senator
comment: Relation between Video Game and Senator

has Golf League
range: golf league
comment: Relation between Video Game and Golf League
domain: video game
type: ObjectProperty
comment: Relazione tra Video Game e Golf League @it

lacrosse league
type: Class
label: ligue de crosse @fr

school
label: école @fr
type: Class

museum
type: Class
label: musée @fr

ship
type: Class
label: navire @fr

fish
label: poisson @fr
type: Class

Axiom
annotated source: has Comics Creator
annotated target: designer
matching quantification: 1

tennis player
type: Class
label: joueur de tennis @fr

has Music Genre
range: music genre
domain: video game
comment: Relation between Video Game and Music Genre
type: ObjectProperty
comment: Relazione tra Video Game e Music Genre @it

video game
label: jeux vidéo @fr
type: Class

trade union
type: Class
label: syndicat professionnel @fr

has Mountain
comment: Relazione tra Video Game e Mountain @it
range: mountain
comment: Relation between Video Game and Mountain
type: ObjectProperty
domain: video game

currency
type: Class
label: devise @fr

has Airline
comment: Relation between Video Game and Airline
domain: video game
comment: Relazione tra Video Game e Airline @it
type: ObjectProperty
range: airline

British royalty
type: Class
label: royauté Britannique @fr

prime minister
type: Class
label: premier ministre @fr

has Tennis Player
comment: Relation between Video Game and Tennis Player
type: ObjectProperty
comment: Relazione tra Video Game e Tennis Player @it
range: tennis player
domain: video game

historic place
label: site historique @fr
type: Class

race
label: course @fr
type: Class

hospital
label: hôpital @fr
type: Class

has Sport
type: ObjectProperty
comment: Relazione tra Video Game e Sport @it
domain: video game
range: sport
comment: Relation between Video Game and Sport

monument
type: Class

has Reptile
domain: video game
comment: Relazione tra Video Game e Reptile @it
comment: Relation between Video Game and Reptile
range: reptile
type: ObjectProperty

has Album
comment: Relation between Video Game and Album
range: album
comment: Relazione tra Video Game e Album @it
type: ObjectProperty
domain: video game
related match: nextAlbum
related match: lastAlbum

has Game
type: ObjectProperty
comment: Relation between Video Game and Game
comment: Relazione tra Video Game e Game @it
range: game
domain: video game

has Ice Hockey Player
type: ObjectProperty
range: ice hockey player
comment: Relation between Video Game and Ice Hockey Player
domain: video game
comment: Relazione tra Video Game e Ice Hockey Player @it

has Town
domain: video game
comment: Relazione tra Video Game e Town @it
comment: Relation between Video Game and Town
range: town
type: ObjectProperty

continent
type: Class
label: ήπειρος @el

has Soccer Club
comment: Relazione tra Video Game e Soccer Club @it
type: ObjectProperty
domain: video game
comment: Relation between Video Game and Soccer Club
range: soccer club

has Saint
type: ObjectProperty
domain: video game
range: saint
comment: Relation between Video Game and Saint
comment: Relazione tra Video Game e Saint @it

has Insect
comment: Relazione tra Video Game e Insect @it
comment: Relation between Video Game and Insect
type: ObjectProperty
domain: video game
range: insect

album
label: Album @de
type: Class

president
type: Class
label: président @fr

figure skater
label: patineur artistique @fr
type: Class

has River
comment: Relation between Video Game and River
comment: Relazione tra Video Game e River @it
type: ObjectProperty
domain: video game
range: river

has Christian Bishop
comment: Relazione tra Video Game e Christian Bishop @it
range: Christian Bishop
type: ObjectProperty
domain: video game
comment: Relation between Video Game and Christian Bishop

military unit
label: unité militaire @fr
type: Class

has Congressman
type: ObjectProperty
domain: video game
comment: Relation between Video Game and Congressman
range: congressman
comment: Relazione tra Video Game e Congressman @it

has American Football Player
type: ObjectProperty
comment: Relazione tra Video Game e American Football Player @it
comment: Relation between Video Game and American Football Player
range: american football player
domain: video game

has Park
type: ObjectProperty
range: park
domain: video game
comment: Relazione tra Video Game e Park @it
comment: Relation between Video Game and Park

has Pope
comment: Relazione tra Video Game e Pope @it
range: pope
domain: video game
type: ObjectProperty
comment: Relation between Video Game and Pope

soccer manager
type: Class
label: entraîneur de football @fr

basketball team
type: Class

has Bird
type: ObjectProperty
comment: Relazione tra Video Game e Bird @it
range: bird
comment: Relation between Video Game and Bird
domain: video game

canadian football team
label: équipe canadienne de football américain @fr
type: Class

music genre
type: Class
label: género musical @pt
label: genre musical @fr

cycad
type: Class
label: cycadophytes @fr

writer
label: écrivain @fr
type: Class

record label
type: Class
label: label discographique @fr

architect
label: architecte @fr
type: Class

has Space Shuttle
type: ObjectProperty
comment: Relation between Video Game and Space Shuttle
range: space shuttle
domain: video game
comment: Relazione tra Video Game e Space Shuttle @it

has Monument
range: monument
comment: Relation between Video Game and Monument
type: ObjectProperty
domain: video game
comment: Relazione tra Video Game e Monument @it

model
label: mannequin @fr
type: Class

city
type: Class
label: cité @fr

crustacean
label: crustacés @fr
type: Class

has Mixed Martial Arts Event
comment: Relation between Video Game and Mixed Martial Arts Event
comment: Relazione tra Video Game e Mixed Martial Arts Event @it
domain: video game
range: mixed martial arts event
type: ObjectProperty

has Hockey Team
comment: Relation between Video Game and Hockey Team
range: hockey team
comment: Relazione tra Video Game e Hockey Team @it
type: ObjectProperty
domain: video game

has Award
type: ObjectProperty
domain: video game
comment: Relation between Video Game and Award
range: award
comment: Relazione tra Video Game e Award @it

Axiom
annotated target: platforms
matching quantification: 1
annotated source: has Non- Profit Organisation

has Comics Creator
range: comics creator
domain: video game
type: ObjectProperty
comment: Relation between Video Game and Comics Creator
comment: Relazione tra Video Game e Comics Creator @it
related match: designer

has University
comment: Relazione tra Video Game e University @it
type: ObjectProperty
range: university
comment: Relation between Video Game and University
domain: video game

has Ginkgo
type: ObjectProperty
comment: Relazione tra Video Game e Ginkgo @it
domain: video game
comment: Relation between Video Game and Ginkgo
range: ginkgo

has Lacrosse League
range: lacrosse league
comment: Relazione tra Video Game e Lacrosse League @it
comment: Relation between Video Game and Lacrosse League
domain: video game
type: ObjectProperty

Grand Prix
label: grand prix @fr
type: Class

has Videogames League
range: videogames league
type: ObjectProperty
domain: video game
comment: Relation between Video Game and Videogames League
comment: Relazione tra Video Game e Videogames League @it

lighthouse
label: phare @fr
type: Class

has Office Holder
type: ObjectProperty
comment: Relazione tra Video Game e Office Holder @it
range: office holder
domain: video game
comment: Relation between Video Game and Office Holder

chancellor
label: chancelier @fr
type: Class

comics creator
type: Class
label: créateur de bandes dessinées @fr

has Restaurant
comment: Relazione tra Video Game e Restaurant @it
domain: video game
range: restaurant
type: ObjectProperty
comment: Relation between Video Game and Restaurant

aircraft
label: avion @fr
type: Class
label: αεροσκάφος @el

has Historic Building
comment: Relation between Video Game and Historic Building
comment: Relazione tra Video Game e Historic Building @it
range: historic building
type: ObjectProperty
domain: video game

has Poker Player
related match: designer
domain: video game
range: poker player
comment: Relation between Video Game and Poker Player
type: ObjectProperty
comment: Relazione tra Video Game e Poker Player @it

hockey team
label: équipe de hockey @fr
type: Class

has Locomotive
domain: video game
comment: Relation between Video Game and Locomotive
comment: Relazione tra Video Game e Locomotive @it
range: locomotive
type: ObjectProperty

soccer player
type: Class
label: joueur de football @fr

Axiom
annotated target: composer
annotated source: has Band
matching quantification: 1

reptile
type: Class

has Space Station
range: space station
comment: Relazione tra Video Game e Space Station @it
domain: video game
type: ObjectProperty
comment: Relation between Video Game and Space Station

legislature
type: Class
label: pouvoir législatif @fr

Axiom
matching quantification: 1
annotated source: has Military Conflict
annotated target: genre

airline
label: compagnie aérienne @fr
type: Class

has Eurovision Song Contest Entry
comment: Relazione tra Video Game e Eurovision Song Contest Entry @it
type: ObjectProperty
range: Eurovision song contest entry
domain: video game
comment: Relation between Video Game and Eurovision Song Contest Entry

monarch
label: monarque @fr
type: Class

has Station
type: ObjectProperty
comment: Relation between Video Game and Station
range: station
comment: Relazione tra Video Game e Station @it
domain: video game

congressman
type: Class
label: membre du Congrès @fr

has Monarch
comment: Relation between Video Game and Monarch
range: monarch
domain: video game
type: ObjectProperty
comment: Relazione tra Video Game e Monarch @it

golf player
label: golfeur @fr
type: Class

has Television Show
domain: video game
comment: Relation between Video Game and Television Show
range: television show
type: ObjectProperty
comment: Relazione tra Video Game e Television Show @it

nascar driver
label: pilote de la nascar @fr
type: Class

journalist
label: journaliste @fr
type: Class

space mission
type: Class
label: διαστημική αποστολή @el
label: mission spatiale @fr

insect
type: Class
label: insecte @fr

film
label: ταινία @el
type: Class

has Film
domain: video game
type: ObjectProperty
comment: Relazione tra Video Game e Film @it
range: film
comment: Relation between Video Game and Film

american football team
label: équipe américaine de football américain @fr
type: Class

has Governor
domain: video game
range: governor
comment: Relation between Video Game and Governor
comment: Relazione tra Video Game e Governor @it
type: ObjectProperty

has Beverage
comment: Relazione tra Video Game e Beverage @it
range: beverage
comment: Relation between Video Game and Beverage
domain: video game
type: ObjectProperty

has Basketball League
domain: video game
comment: Relazione tra Video Game e Basketball League @it
comment: Relation between Video Game and Basketball League
range: basketball league
type: ObjectProperty

Axiom
annotated source: has Musical Artist
matching quantification: 248
annotated target: composer

has Musical Artist
related match: composers
related match: composer
range: musical artist
comment: Relation between Video Game and Musical Artist
related match: designer
comment: Relazione tra Video Game e Musical Artist @it
type: ObjectProperty
domain: video game
related match: artist

has Aircraft
type: ObjectProperty
comment: Relation between Video Game and Aircraft
domain: video game
comment: Relazione tra Video Game e Aircraft @it
range: aircraft

has Music Festival
domain: video game
comment: Relation between Video Game and Music Festival
comment: Relazione tra Video Game e Music Festival @it
range: music festival
type: ObjectProperty

chemical compound
label: produit chimique @fr
type: Class

bird
type: Class
label: oiseau @fr

has Chancellor
comment: Relazione tra Video Game e Chancellor @it
range: chancellor
comment: Relation between Video Game and Chancellor
type: ObjectProperty
domain: video game

Gaelic games player
type: Class
label: joueur de sports gaéliques @fr

has Drug
comment: Relation between Video Game and Drug
type: ObjectProperty
range: drug
comment: Relazione tra Video Game e Drug @it
domain: video game

Axiom
matching quantification: 5
annotated target: writer
annotated source: has Writer

has College
domain: video game
range: college
type: ObjectProperty
comment: Relazione tra Video Game e College @it
comment: Relation between Video Game and College

fungus
label: fungi @fr
type: Class

fern
label: fougères @fr
type: Class

musical artist
label: musicien @fr
type: Class
label: artista musical @pt

has Broadcast
domain: video game
type: ObjectProperty
range: broadcast
comment: Relazione tra Video Game e Broadcast @it
comment: Relation between Video Game and Broadcast

has Prime Minister
range: prime minister
comment: Relazione tra Video Game e Prime Minister @it
comment: Relation between Video Game and Prime Minister
domain: video game
type: ObjectProperty

has British Royalty
comment: Relation between Video Game and British Royalty
comment: Relazione tra Video Game e British Royalty @it
type: ObjectProperty
domain: video game
range: British royalty

has Grand Prix
domain: video game
comment: Relation between Video Game and Grand Prix
range: Grand Prix
type: ObjectProperty
comment: Relazione tra Video Game e Grand Prix @it

has Island
range: island
comment: Relazione tra Video Game e Island @it
domain: video game
comment: Relation between Video Game and Island
type: ObjectProperty

has Protected Area
range: protected area
type: ObjectProperty
comment: Relazione tra Video Game e Protected Area @it
comment: Relation between Video Game and Protected Area
domain: video game

park
label: parc @fr
type: Class

brain
label: cerveau @fr
type: Class

has Book
type: ObjectProperty
comment: Relation between Video Game and Book
comment: Relazione tra Video Game e Book @it
domain: video game
range: book

Axiom
annotated source: has Continent
matching quantification: 1
annotated target: released

rugby player
type: Class
label: joueur de rugby @fr

has American Football League
domain: video game
comment: Relation between Video Game and American Football League
type: ObjectProperty
range: american football league
comment: Relazione tra Video Game e American Football League @it

has Basketball Team
type: ObjectProperty
comment: Relation between Video Game and Basketball Team
comment: Relazione tra Video Game e Basketball Team @it
range: basketball team
domain: video game

american football league
type: Class

has Currency
type: ObjectProperty
range: currency
domain: video game
comment: Relazione tra Video Game e Currency @it
comment: Relation between Video Game and Currency

musical
type: Class
label: musique @fr

Axiom
annotated target: lastAlbum
matching quantification: 1
annotated source: has Album

cyclist
type: Class
label: cycliste @fr

has Soccer Manager
range: soccer manager
type: ObjectProperty
domain: video game
comment: Relation between Video Game and Soccer Manager
comment: Relazione tra Video Game e Soccer Manager @it

has Adult Actor
comment: Relation between Video Game and Adult Actor
type: ObjectProperty
domain: video game
comment: Relazione tra Video Game e Adult Actor @it
range: adult actor

wrestling event
label: match de catch @fr
type: Class

has Canadian Football Team
comment: Relation between Video Game and Canadian Football Team
range: canadian football team
comment: Relazione tra Video Game e Canadian Football Team @it
type: ObjectProperty
domain: video game

basketball league
type: Class
label: ligue de basketball @fr

mountain
type: Class
label: montagne @fr
label: Βουνό @el

Axiom
matching quantification: 1
annotated source: has Musical Artist
annotated target: designer

criminal
type: Class
label: criminel @fr

has Bacteria
range: bacteria
domain: video game
comment: Relazione tra Video Game e Bacteria @it
comment: Relation between Video Game and Bacteria
type: ObjectProperty

space shuttle
label: navette spatiale @fr
type: Class

flowering plant
label: angiospermes @fr
type: Class

Axiom
matching quantification: 1
annotated source: has Musical Artist
annotated target: composers

senator
type: Class
label: sénateur @fr

saint
type: Class

valley
type: Class
label: vallée @fr

comedian
type: Class
label: comédien @fr

has Rocket
domain: video game
type: ObjectProperty
range: rocket
comment: Relation between Video Game and Rocket
comment: Relazione tra Video Game e Rocket @it

Playboy Playmate
type: Class
label: playmate pour Playboy @fr

has Comedian
domain: video game
range: comedian
comment: Relation between Video Game and Comedian
comment: Relazione tra Video Game e Comedian @it
type: ObjectProperty

convention
type: Class
label: congrès @fr

book
label: llibre @ca
label: książka @pl
label: βιβλίο @el
label: livre @fr
type: Class

has Musical
comment: Relazione tra Video Game e Musical @it
comment: Relation between Video Game and Musical
range: musical
type: ObjectProperty
domain: video game

has Space Mission
comment: Relation between Video Game and Space Mission
domain: video game
type: ObjectProperty
comment: Relazione tra Video Game e Space Mission @it
range: space mission

shopping mall
label: centre commercial @fr
type: Class

has Planet
type: ObjectProperty
comment: Relazione tra Video Game e Planet @it
domain: video game
comment: Relation between Video Game and Planet
range: planet

has Weapon
domain: video game
type: ObjectProperty
comment: Relation between Video Game and Weapon
range: weapon
comment: Relazione tra Video Game e Weapon @it

has Criminal
type: ObjectProperty
domain: video game
comment: Relazione tra Video Game e Criminal @it
range: criminal
comment: Relation between Video Game and Criminal

Ontology
has author: Andrea Giovanni Nuzzolese
imports: cpannotationschema.owl
comment: VideoGame Encyclopedic Knowledge Pattern
extracted from: en.wikipedia.org
has author: Aldo Gangemi
has author: Valentina Presutti
extracted from: dbpedia.org
has intent: To represent the encyclopedic knowledge expressed by an object typed as VideoGame

has Soccer League
comment: Relation between Video Game and Soccer League
range: soccer league
domain: video game
comment: Relazione tra Video Game e Soccer League @it
type: ObjectProperty

has Continent
related match: released
type: ObjectProperty
range: continent
domain: video game
comment: Relazione tra Video Game e Continent @it
comment: Relation between Video Game and Continent

bacteria
label: bactérie @fr
type: Class

ski area
label: domaine skiable @fr
type: Class

has Mollusca
comment: Relazione tra Video Game e Mollusca @it
comment: Relation between Video Game and Mollusca
type: ObjectProperty
range: mollusca
domain: video game

has Historic Place
comment: Relation between Video Game and Historic Place
comment: Relazione tra Video Game e Historic Place @it
range: historic place
domain: video game
type: ObjectProperty

space station
label: station spatiale @fr
type: Class

non-profit organisation
label: organisation à but non lucratif @fr
type: Class

has Model
range: model
domain: video game
type: ObjectProperty
comment: Relation between Video Game and Model
comment: Relazione tra Video Game e Model @it

canadian football league
type: Class

rugby league
type: Class
label: ligue de rugby @fr

mollusca
type: Class
label: mollusque @fr

has Ski Area
range: ski area
domain: video game
type: ObjectProperty
comment: Relation between Video Game and Ski Area
comment: Relazione tra Video Game e Ski Area @it

Axiom
matching quantification: 1
annotated target: nextAlbum
annotated source: has Album

has Flowering Plant
comment: Relazione tra Video Game e Flowering Plant @it
type: ObjectProperty
range: flowering plant
comment: Relation between Video Game and Flowering Plant
domain: video game

weapon
type: Class
label: arme @fr

drug
type: Class
label: médicament @fr

has Wrestler
comment: Relation between Video Game and Wrestler
comment: Relazione tra Video Game e Wrestler @it
range: wrestler
domain: video game
type: ObjectProperty

canal
type: Class

has Village
range: village
comment: Relation between Video Game and Village
comment: Relazione tra Video Game e Village @it
domain: video game
type: ObjectProperty

military person
label: militaire @fr
type: Class

has Wrestling Event
comment: Relation between Video Game and Wrestling Event
domain: video game
range: wrestling event
comment: Relazione tra Video Game e Wrestling Event @it
type: ObjectProperty

philosopher
label: philosophe @fr
type: Class

award
label: récompense @fr
type: Class

locomotive
type: Class

has Lighthouse
domain: video game
comment: Relazione tra Video Game e Lighthouse @it
comment: Relation between Video Game and Lighthouse
range: lighthouse
type: ObjectProperty

has Writer
related match: writer
related match: designer
comment: Relation between Video Game and Writer
domain: video game
type: ObjectProperty
comment: Relazione tra Video Game e Writer @it
range: writer

has Gaelic Games Player
comment: Relation between Video Game and Gaelic Games Player
comment: Relazione tra Video Game e Gaelic Games Player @it
range: Gaelic games player
type: ObjectProperty
domain: video game

college
type: Class

sport
type: Class

has Language
domain: video game
comment: Relazione tra Video Game e Language @it
type: ObjectProperty
comment: Relation between Video Game and Language
range: language

restaurant
type: Class

cricketer
type: Class
label: joueur de cricket @fr

Axiom
annotated source: has Military Unit
annotated target: developer
matching quantification: 1

single
type: Class

mixed martial arts event
type: Class
label: évènement d'arts martiaux mixtes @fr

has Military Unit
related match: developer
comment: Relation between Video Game and Military Unit
range: military unit
type: ObjectProperty
domain: video game
comment: Relazione tra Video Game e Military Unit @it

Band
label: groupe de musique @fr
type: Class
label: Musikgruppe @de
label: banda @pt

town
type: Class
label: ville @fr

has Mammal
comment: Relazione tra Video Game e Mammal @it
range: mammal
domain: video game
type: ObjectProperty
comment: Relation between Video Game and Mammal

has Canadian Football League
domain: video game
type: ObjectProperty
range: canadian football league
comment: Relazione tra Video Game e Canadian Football League @it
comment: Relation between Video Game and Canadian Football League

university
type: Class
label: université @fr
label: πανεπιστήμιο @el

has Olympics
comment: Relazione tra Video Game e Olympics @it
type: ObjectProperty
comment: Relation between Video Game and Olympics
range: olympics
domain: video game

has Scientist
domain: video game
type: ObjectProperty
comment: Relation between Video Game and Scientist
range: scientist
comment: Relazione tra Video Game e Scientist @it

protein
label: protéine @fr
type: Class

has Newspaper
range: newspaper
domain: video game
comment: Relation between Video Game and Newspaper
comment: Relazione tra Video Game e Newspaper @it
type: ObjectProperty

ethnic group
label: groupe ethnique @fr
type: Class

has Military Person
domain: video game
type: ObjectProperty
comment: Relation between Video Game and Military Person
comment: Relazione tra Video Game e Military Person @it
range: military person

has Motorcycle Racing League
comment: Relation between Video Game and Motorcycle Racing League
comment: Relazione tra Video Game e Motorcycle Racing League @it
domain: video game
type: ObjectProperty
range: motorcycle racing league

has Election
domain: video game
comment: Relation between Video Game and Election
type: ObjectProperty
comment: Relazione tra Video Game e Election @it
range: Election

motorcycle racing league
type: Class
label: ligue de courses motocycliste @fr

Axiom
annotated source: has Poker Player
annotated target: designer
matching quantification: 1

hotel
type: Class
label: hôtel @fr

music festival
type: Class
label: festival de musique @fr

has Canal
type: ObjectProperty
domain: video game
comment: Relazione tra Video Game e Canal @it
comment: Relation between Video Game and Canal
range: canal

college coach
type: Class
label: entraîneur universitaire @fr

television episode
type: Class
label: épisode télévisé @fr

has Shopping Mall
comment: Relazione tra Video Game e Shopping Mall @it
comment: Relation between Video Game and Shopping Mall
range: shopping mall
domain: video game
type: ObjectProperty

village
label: χωριό @el
type: Class

ice hockey league
label: ligue d'hockey sur glace @fr
type: Class

Axiom
matching quantification: 3
annotated source: has Band
annotated target: music

has American Football Team
type: ObjectProperty
domain: video game
comment: Relazione tra Video Game e American Football Team @it
range: american football team
comment: Relation between Video Game and American Football Team

has City
range: city
type: ObjectProperty
domain: video game
comment: Relation between Video Game and City
comment: Relazione tra Video Game e City @it
related match: subdivisionName

soccer club
label: club de football @fr
type: Class

has Race
range: race
comment: Relazione tra Video Game e Race @it
comment: Relation between Video Game and Race
domain: video game
type: ObjectProperty

historic building
label: bâtiment historique @fr
type: Class

has Convention
range: convention
comment: Relation between Video Game and Convention
comment: Relazione tra Video Game e Convention @it
type: ObjectProperty
domain: video game

office holder
label: titulaire @fr
label: Amtsinhaber @de
type: Class

has Colour
comment: Relazione tra Video Game e Colour @it
comment: Relation between Video Game and Colour
range: colour
domain: video game
type: ObjectProperty

baseball player
label: joueur de baseball @fr
type: Class

military conflict
type: Class
label: conflit militaire @fr

has Arachnid
type: ObjectProperty
domain: video game
comment: Relazione tra Video Game e Arachnid @it
comment: Relation between Video Game and Arachnid
range: arachnid

has Soccer Player
comment: Relation between Video Game and Soccer Player
range: soccer player
type: ObjectProperty
comment: Relazione tra Video Game e Soccer Player @it
domain: video game

has Mountain Range
type: ObjectProperty
domain: video game
range: mountain range
comment: Relation between Video Game and Mountain Range
comment: Relazione tra Video Game e Mountain Range @it

Axiom
annotated source: has Writer
annotated target: designer
matching quantification: 2

basketball player
label: joueur de basketball @fr
type: Class

adult actor
label: erwachsener Schauspieler @de
type: Class
label: acteur adulte @fr

has Protein
comment: Relazione tra Video Game e Protein @it
range: protein
domain: video game
comment: Relation between Video Game and Protein
type: ObjectProperty

has Cycad
domain: video game
comment: Relation between Video Game and Cycad
comment: Relazione tra Video Game e Cycad @it
type: ObjectProperty
range: cycad

Axiom
matching quantification: 1
annotated source: has Baseball Player
annotated target: programming

has Road
domain: video game
type: ObjectProperty
comment: Relation between Video Game and Road
comment: Relazione tra Video Game e Road @it
range: road

ice hockey player
type: Class
label: joueur de hockey sur glace @fr

has Museum
comment: Relazione tra Video Game e Museum @it
type: ObjectProperty
range: museum
domain: video game
comment: Relation between Video Game and Museum

Christian Bishop
type: Class
label: évêque chrétien @fr

mountain range
type: Class
label: chaîne de montagne @fr

has Hospital
range: hospital
comment: Relation between Video Game and Hospital
type: ObjectProperty
comment: Relazione tra Video Game e Hospital @it
domain: video game

beverage
type: Class
label: boisson @fr

has Philosopher
comment: Relation between Video Game and Philosopher
range: philosopher
type: ObjectProperty
domain: video game
comment: Relazione tra Video Game e Philosopher @it

has Lake
comment: Relation between Video Game and Lake
range: lake
type: ObjectProperty
domain: video game
comment: Relazione tra Video Game e Lake @it

has Figure Skater
domain: video game
range: figure skater
type: ObjectProperty
comment: Relation between Video Game and Figure Skater
comment: Relazione tra Video Game e Figure Skater @it

Axiom
annotated source: has Musical Artist
annotated target: artist
matching quantification: 1

planet
type: Class
label: planète @fr

scientist
label: scientifique @fr
type: Class
label: Wissenschaftler @de

has Radio Station
type: ObjectProperty
domain: video game
comment: Relation between Video Game and Radio Station
comment: Relazione tra Video Game e Radio Station @it
range: radio station

golf league
type: Class
label: ligue de golf @fr

has Rugby Player
domain: video game
comment: Relazione tra Video Game e Rugby Player @it
range: rugby player
type: ObjectProperty
comment: Relation between Video Game and Rugby Player

has Bone
comment: Relazione tra Video Game e Bone @it
comment: Relation between Video Game and Bone
range: bone
type: ObjectProperty
domain: video game

olympics
type: Class
label: Jeux Olympiques @fr

baseball league
label: ligue de baseball @fr
type: Class

has Rugby League
range: rugby league
domain: video game
comment: Relazione tra Video Game e Rugby League @it
comment: Relation between Video Game and Rugby League
type: ObjectProperty

has Non- Profit Organisation
related match: platforms
comment: Relazione tra Video Game e Non- Profit Organisation @it
range: non-profit organisation
comment: Relation between Video Game and Non- Profit Organisation
domain: video game
type: ObjectProperty

bridge
label: pont @fr
type: Class

has College Coach
range: college coach
comment: Relazione tra Video Game e College Coach @it
type: ObjectProperty
comment: Relation between Video Game and College Coach
domain: video game

has Band
related match: music
related match: composer
comment: Relazione tra Video Game e Band @it
domain: video game
type: ObjectProperty
comment: Relation between Video Game and Band
range: Band

has Basketball Player
comment: Relation between Video Game and Basketball Player
domain: video game
range: basketball player
type: ObjectProperty
comment: Relazione tra Video Game e Basketball Player @it

broadcast
type: Class
label: Émission de télévision @fr

Axiom
annotated source: has City
annotated target: subdivisionName
matching quantification: 1

has Conifer
type: ObjectProperty
range: conifer
comment: Relazione tra Video Game e Conifer @it
domain: video game
comment: Relation between Video Game and Conifer

has Television Episode
domain: video game
comment: Relation between Video Game and Television Episode
range: television episode
type: ObjectProperty
comment: Relazione tra Video Game e Television Episode @it

mammal
label: mammifère @fr
type: Class

Eurovision song contest entry
label: concours Eurovision de la chanson @fr
type: Class

island
label: île @fr
label: νησί @el
type: Class

comics character
type: Class
label: personnage de bandes dessinées @fr

has Architect
comment: Relazione tra Video Game e Architect @it
type: ObjectProperty
domain: video game
comment: Relation between Video Game and Architect
range: architect

Formula One racer
label: pilote de formule 1 @fr
type: Class

skyscraper
label: gratte-ciel @fr
type: Class

has Skyscraper
range: skyscraper
type: ObjectProperty
comment: Relazione tra Video Game e Skyscraper @it
domain: video game
comment: Relation between Video Game and Skyscraper

has Amphibian
comment: Relation between Video Game and Amphibian
range: amphibian
domain: video game
comment: Relazione tra Video Game e Amphibian @it
type: ObjectProperty

radio station
label: station de radio @fr
type: Class

member of parliament
type: Class
label: membre du Parlement @fr

bone
label: os @fr
label: Knochen @de
type: Class

has Golf Player
type: ObjectProperty
comment: Relazione tra Video Game e Golf Player @it
comment: Relation between Video Game and Golf Player
range: golf player
domain: video game

conifer
type: Class
label: conifères @fr

airport
label: aéroport @fr
label: Flughafen @de
type: Class