television show
label: émission de télévision @fr
type: Class

disease
label: maladie @fr
type: Class

colour
label: χρώμα @el
label: couleur @fr
type: Class

has Saint
comment: Relazione tra World Heritage Site e Saint @it
comment: Relation between World Heritage Site and Saint
type: ObjectProperty
domain: World Heritage Site
range: saint

has Magazine
domain: World Heritage Site
comment: Relazione tra World Heritage Site e Magazine @it
type: ObjectProperty
comment: Relation between World Heritage Site and Magazine
range: magazine

stadium
label: stade @fr
type: Class

astronaut
type: Class
label: Astronaut @de
label: astronaute @fr

has Village
related match: nearestCity
comment: Relation between World Heritage Site and Village
type: ObjectProperty
comment: Relazione tra World Heritage Site e Village @it
range: village
domain: World Heritage Site

has Band
comment: Relazione tra World Heritage Site e Band @it
domain: World Heritage Site
type: ObjectProperty
range: Band
comment: Relation between World Heritage Site and Band

has Cycad
domain: World Heritage Site
type: ObjectProperty
comment: Relation between World Heritage Site and Cycad
comment: Relazione tra World Heritage Site e Cycad @it
range: cycad

has Mountain
domain: World Heritage Site
comment: Relation between World Heritage Site and Mountain
range: mountain
type: ObjectProperty
comment: Relazione tra World Heritage Site e Mountain @it

has President
domain: World Heritage Site
range: president
type: ObjectProperty
comment: Relazione tra World Heritage Site e President @it
comment: Relation between World Heritage Site and President

has Military Person
type: ObjectProperty
domain: World Heritage Site
range: military person
comment: Relazione tra World Heritage Site e Military Person @it
comment: Relation between World Heritage Site and Military Person

Site of Special Scientific Interest
label: site d'intérêt scientifique particulier @fr
type: Class

amphibian
label: amphibien @fr
type: Class

pope
label: pape @fr
type: Class

has Reptile
comment: Relazione tra World Heritage Site e Reptile @it
comment: Relation between World Heritage Site and Reptile
range: reptile
domain: World Heritage Site
type: ObjectProperty

newspaper
label: journal @fr
type: Class

has Sport
domain: World Heritage Site
comment: Relazione tra World Heritage Site e Sport @it
range: sport
type: ObjectProperty
comment: Relation between World Heritage Site and Sport

game
type: Class
label: jeu @fr

protected area
type: Class
label: προστατευμένη περιοχή @el
label: aire protégée @fr

road
type: Class
label: route @fr

ginkgo
type: Class

World Heritage Site
type: Class
label: site du patrimoine mondial @fr

station
type: Class

has Website
comment: Relazione tra World Heritage Site e Website @it
type: ObjectProperty
domain: World Heritage Site
comment: Relation between World Heritage Site and Website
range: website

has Military Unit
type: ObjectProperty
range: military unit
comment: Relazione tra World Heritage Site e Military Unit @it
comment: Relation between World Heritage Site and Military Unit
domain: World Heritage Site

lake
type: Class
label: lac @fr

has Writer
comment: Relazione tra World Heritage Site e Writer @it
comment: Relation between World Heritage Site and Writer
type: ObjectProperty
domain: World Heritage Site
range: writer

arachnid
label: arachnides @fr
type: Class

has Fish
comment: Relation between World Heritage Site and Fish
range: fish
comment: Relazione tra World Heritage Site e Fish @it
type: ObjectProperty
domain: World Heritage Site

has Hospital
comment: Relation between World Heritage Site and Hospital
range: hospital
comment: Relazione tra World Heritage Site e Hospital @it
domain: World Heritage Site
type: ObjectProperty

governor
label: gouverneur @fr
type: Class

river
label: rivière @fr
type: Class

has Fern
domain: World Heritage Site
type: ObjectProperty
range: fern
comment: Relation between World Heritage Site and Fern
comment: Relazione tra World Heritage Site e Fern @it

school
label: école @fr
type: Class

fish
label: poisson @fr
type: Class

museum
label: musée @fr
type: Class

ship
type: Class
label: navire @fr

video game
label: jeux vidéo @fr
type: Class

has Space Mission
range: space mission
domain: World Heritage Site
comment: Relazione tra World Heritage Site e Space Mission @it
comment: Relation between World Heritage Site and Space Mission
type: ObjectProperty

has Historic Place
range: historic place
domain: World Heritage Site
comment: Relation between World Heritage Site and Historic Place
type: ObjectProperty
comment: Relazione tra World Heritage Site e Historic Place @it

currency
type: Class
label: devise @fr

prime minister
label: premier ministre @fr
type: Class

historic place
label: site historique @fr
type: Class

hospital
label: hôpital @fr
type: Class

has Astronaut
comment: Relation between World Heritage Site and Astronaut
range: astronaut
comment: Relazione tra World Heritage Site e Astronaut @it
type: ObjectProperty
domain: World Heritage Site

has Grape
type: ObjectProperty
comment: Relation between World Heritage Site and Grape
comment: Relazione tra World Heritage Site e Grape @it
range: grape
domain: World Heritage Site

has Monarch
comment: Relation between World Heritage Site and Monarch
comment: Relazione tra World Heritage Site e Monarch @it
range: monarch
domain: World Heritage Site
type: ObjectProperty

has Governor
comment: Relation between World Heritage Site and Governor
range: governor
comment: Relazione tra World Heritage Site e Governor @it
domain: World Heritage Site
type: ObjectProperty

has Valley
domain: World Heritage Site
comment: Relation between World Heritage Site and Valley
comment: Relazione tra World Heritage Site e Valley @it
range: valley
type: ObjectProperty

has River
range: river
comment: Relation between World Heritage Site and River
type: ObjectProperty
comment: Relazione tra World Heritage Site e River @it
domain: World Heritage Site

has Embryology
range: embryology
domain: World Heritage Site
type: ObjectProperty
comment: Relazione tra World Heritage Site e Embryology @it
comment: Relation between World Heritage Site and Embryology

continent
label: ήπειρος @el
type: Class

has Insect
domain: World Heritage Site
type: ObjectProperty
range: insect
comment: Relazione tra World Heritage Site e Insect @it
comment: Relation between World Heritage Site and Insect

president
type: Class
label: président @fr

album
type: Class
label: Album @de

moss
label: mousses @fr
type: Class

military unit
label: unité militaire @fr
type: Class

has Film
comment: Relation between World Heritage Site and Film
range: film
type: ObjectProperty
domain: World Heritage Site
comment: Relazione tra World Heritage Site e Film @it

basketball team
type: Class

music genre
label: genre musical @fr
label: género musical @pt
type: Class

has Locomotive
type: ObjectProperty
comment: Relazione tra World Heritage Site e Locomotive @it
range: locomotive
domain: World Heritage Site
comment: Relation between World Heritage Site and Locomotive

cycad
type: Class
label: cycadophytes @fr

has Drug
domain: World Heritage Site
type: ObjectProperty
comment: Relation between World Heritage Site and Drug
comment: Relazione tra World Heritage Site e Drug @it
range: drug

writer
label: écrivain @fr
type: Class

has Soccer Player
domain: World Heritage Site
type: ObjectProperty
range: soccer player
comment: Relazione tra World Heritage Site e Soccer Player @it
comment: Relation between World Heritage Site and Soccer Player

architect
label: architecte @fr
type: Class

has Lake
comment: Relazione tra World Heritage Site e Lake @it
domain: World Heritage Site
type: ObjectProperty
range: lake
comment: Relation between World Heritage Site and Lake

has Mountain Range
domain: World Heritage Site
type: ObjectProperty
range: mountain range
comment: Relazione tra World Heritage Site e Mountain Range @it
comment: Relation between World Heritage Site and Mountain Range

crustacean
label: crustacés @fr
type: Class

has Olympics
comment: Relazione tra World Heritage Site e Olympics @it
range: olympics
type: ObjectProperty
domain: World Heritage Site
comment: Relation between World Heritage Site and Olympics

has Continent
type: ObjectProperty
range: continent
comment: Relation between World Heritage Site and Continent
comment: Relazione tra World Heritage Site e Continent @it
domain: World Heritage Site

has Amphibian
comment: Relation between World Heritage Site and Amphibian
range: amphibian
comment: Relazione tra World Heritage Site e Amphibian @it
domain: World Heritage Site
type: ObjectProperty

lighthouse
type: Class
label: phare @fr

has Actor
type: ObjectProperty
domain: World Heritage Site
comment: Relazione tra World Heritage Site e Actor @it
comment: Relation between World Heritage Site and Actor
range: actor

chancellor
label: chancelier @fr
type: Class

comics creator
type: Class
label: créateur de bandes dessinées @fr

has Site Of Special Scientific Interest
comment: Relation between World Heritage Site and Site Of Special Scientific Interest
range: Site of Special Scientific Interest
comment: Relazione tra World Heritage Site e Site Of Special Scientific Interest @it
domain: World Heritage Site
type: ObjectProperty

hockey team
label: équipe de hockey @fr
type: Class

has Award
domain: World Heritage Site
range: award
type: ObjectProperty
comment: Relation between World Heritage Site and Award
comment: Relazione tra World Heritage Site e Award @it

has Christian Bishop
domain: World Heritage Site
comment: Relazione tra World Heritage Site e Christian Bishop @it
type: ObjectProperty
range: Christian Bishop
comment: Relation between World Heritage Site and Christian Bishop

club moss
label: lycopodiopsida @fr
type: Class

soccer player
label: joueur de football @fr
type: Class

has University
comment: Relation between World Heritage Site and University
domain: World Heritage Site
type: ObjectProperty
comment: Relazione tra World Heritage Site e University @it
range: university

reptile
type: Class

legislature
label: pouvoir législatif @fr
type: Class

has Broadcast
range: broadcast
domain: World Heritage Site
comment: Relazione tra World Heritage Site e Broadcast @it
comment: Relation between World Heritage Site and Broadcast
type: ObjectProperty

has Green Alga
range: green alga
type: ObjectProperty
domain: World Heritage Site
comment: Relazione tra World Heritage Site e Green Alga @it
comment: Relation between World Heritage Site and Green Alga

has Park
domain: World Heritage Site
comment: Relazione tra World Heritage Site e Park @it
comment: Relation between World Heritage Site and Park
type: ObjectProperty
range: park

airline
label: compagnie aérienne @fr
type: Class

has Disease
domain: World Heritage Site
range: disease
type: ObjectProperty
comment: Relation between World Heritage Site and Disease
comment: Relazione tra World Heritage Site e Disease @it

monarch
type: Class
label: monarque @fr

has Television Episode
type: ObjectProperty
range: television episode
domain: World Heritage Site
comment: Relation between World Heritage Site and Television Episode
comment: Relazione tra World Heritage Site e Television Episode @it

has Prime Minister
comment: Relation between World Heritage Site and Prime Minister
domain: World Heritage Site
comment: Relazione tra World Heritage Site e Prime Minister @it
type: ObjectProperty
range: prime minister

space mission
type: Class
label: διαστημική αποστολή @el
label: mission spatiale @fr

insect
label: insecte @fr
type: Class

film
type: Class
label: ταινία @el

has Skyscraper
comment: Relation between World Heritage Site and Skyscraper
range: skyscraper
type: ObjectProperty
domain: World Heritage Site
comment: Relazione tra World Heritage Site e Skyscraper @it

bird
type: Class
label: oiseau @fr

chemical compound
type: Class
label: produit chimique @fr

power station
type: Class

fungus
label: fungi @fr
type: Class

musical artist
label: musicien @fr
type: Class
label: artista musical @pt

has Game
comment: Relazione tra World Heritage Site e Game @it
type: ObjectProperty
comment: Relation between World Heritage Site and Game
domain: World Heritage Site
range: game

fern
type: Class
label: fougères @fr

has Club Moss
domain: World Heritage Site
range: club moss
comment: Relazione tra World Heritage Site e Club Moss @it
comment: Relation between World Heritage Site and Club Moss
type: ObjectProperty

has Power Station
comment: Relazione tra World Heritage Site e Power Station @it
comment: Relation between World Heritage Site and Power Station
type: ObjectProperty
range: power station
domain: World Heritage Site

has Island
type: ObjectProperty
comment: Relation between World Heritage Site and Island
comment: Relazione tra World Heritage Site e Island @it
domain: World Heritage Site
range: island

park
type: Class
label: parc @fr

cardinal
type: Class

has Architect
comment: Relation between World Heritage Site and Architect
range: architect
type: ObjectProperty
domain: World Heritage Site
comment: Relazione tra World Heritage Site e Architect @it

has Beverage
comment: Relation between World Heritage Site and Beverage
range: beverage
type: ObjectProperty
domain: World Heritage Site
comment: Relazione tra World Heritage Site e Beverage @it

has Station
range: station
domain: World Heritage Site
comment: Relazione tra World Heritage Site e Station @it
type: ObjectProperty
comment: Relation between World Heritage Site and Station

has Hotel
range: hotel
type: ObjectProperty
comment: Relation between World Heritage Site and Hotel
domain: World Heritage Site
comment: Relazione tra World Heritage Site e Hotel @it

has Arachnid
range: arachnid
comment: Relazione tra World Heritage Site e Arachnid @it
domain: World Heritage Site
type: ObjectProperty
comment: Relation between World Heritage Site and Arachnid

has Museum
type: ObjectProperty
comment: Relazione tra World Heritage Site e Museum @it
range: museum
domain: World Heritage Site
comment: Relation between World Heritage Site and Museum

actor
label: acteur @fr
type: Class
label: Schauspieler @de

has Lighthouse
comment: Relation between World Heritage Site and Lighthouse
type: ObjectProperty
comment: Relazione tra World Heritage Site e Lighthouse @it
domain: World Heritage Site
range: lighthouse

has Chancellor
domain: World Heritage Site
range: chancellor
comment: Relazione tra World Heritage Site e Chancellor @it
comment: Relation between World Heritage Site and Chancellor
type: ObjectProperty

has Single
comment: Relation between World Heritage Site and Single
comment: Relazione tra World Heritage Site e Single @it
range: single
domain: World Heritage Site
type: ObjectProperty

has Bird
type: ObjectProperty
comment: Relazione tra World Heritage Site e Bird @it
range: bird
domain: World Heritage Site
comment: Relation between World Heritage Site and Bird

has Ice Hockey Player
type: ObjectProperty
domain: World Heritage Site
range: ice hockey player
comment: Relation between World Heritage Site and Ice Hockey Player
comment: Relazione tra World Heritage Site e Ice Hockey Player @it

has Ethnic Group
domain: World Heritage Site
type: ObjectProperty
comment: Relazione tra World Heritage Site e Ethnic Group @it
comment: Relation between World Heritage Site and Ethnic Group
range: ethnic group

basketball league
label: ligue de basketball @fr
type: Class

mountain
type: Class
label: montagne @fr
label: Βουνό @el

has Soccer Club
comment: Relation between World Heritage Site and Soccer Club
range: soccer club
domain: World Heritage Site
comment: Relazione tra World Heritage Site e Soccer Club @it
type: ObjectProperty

has Office Holder
comment: Relazione tra World Heritage Site e Office Holder @it
type: ObjectProperty
range: office holder
domain: World Heritage Site
comment: Relation between World Heritage Site and Office Holder

has Fungus
range: fungus
domain: World Heritage Site
type: ObjectProperty
comment: Relazione tra World Heritage Site e Fungus @it
comment: Relation between World Heritage Site and Fungus

Axiom
matching quantification: 1
annotated target: nearestCity
annotated source: has Village

has Pope
type: ObjectProperty
comment: Relazione tra World Heritage Site e Pope @it
comment: Relation between World Heritage Site and Pope
range: pope
domain: World Heritage Site

senator
type: Class
label: sénateur @fr

saint
type: Class

comedian
label: comédien @fr
type: Class

has Bacteria
comment: Relazione tra World Heritage Site e Bacteria @it
comment: Relation between World Heritage Site and Bacteria
range: bacteria
domain: World Heritage Site
type: ObjectProperty

valley
label: vallée @fr
type: Class

has Currency
type: ObjectProperty
comment: Relation between World Heritage Site and Currency
comment: Relazione tra World Heritage Site e Currency @it
domain: World Heritage Site
range: currency

green alga
label: algue verte @fr
type: Class

has College
range: college
comment: Relazione tra World Heritage Site e College @it
comment: Relation between World Heritage Site and College
domain: World Heritage Site
type: ObjectProperty

book
type: Class
label: livre @fr
label: βιβλίο @el
label: książka @pl
label: llibre @ca

has Ginkgo
comment: Relazione tra World Heritage Site e Ginkgo @it
range: ginkgo
domain: World Heritage Site
comment: Relation between World Heritage Site and Ginkgo
type: ObjectProperty

shopping mall
type: Class
label: centre commercial @fr

bacteria
type: Class
label: bactérie @fr

has Cardinal
comment: Relation between World Heritage Site and Cardinal
range: cardinal
domain: World Heritage Site
comment: Relazione tra World Heritage Site e Cardinal @it
type: ObjectProperty

non-profit organisation
type: Class
label: organisation à but non lucratif @fr

space station
label: station spatiale @fr
type: Class

has Colour
domain: World Heritage Site
comment: Relation between World Heritage Site and Colour
comment: Relazione tra World Heritage Site e Colour @it
range: colour
type: ObjectProperty

has Television Show
range: television show
type: ObjectProperty
comment: Relation between World Heritage Site and Television Show
domain: World Heritage Site
comment: Relazione tra World Heritage Site e Television Show @it

mollusca
label: mollusque @fr
type: Class

has Philosopher
domain: World Heritage Site
range: philosopher
comment: Relazione tra World Heritage Site e Philosopher @it
comment: Relation between World Heritage Site and Philosopher
type: ObjectProperty

has Moss
type: ObjectProperty
comment: Relazione tra World Heritage Site e Moss @it
comment: Relation between World Heritage Site and Moss
domain: World Heritage Site
range: moss

weapon
label: arme @fr
type: Class

drug
type: Class
label: médicament @fr

has Scientist
domain: World Heritage Site
range: scientist
comment: Relation between World Heritage Site and Scientist
comment: Relazione tra World Heritage Site e Scientist @it
type: ObjectProperty

magazine
type: Class
label: περιοδικό @el

has Town
range: town
type: ObjectProperty
comment: Relazione tra World Heritage Site e Town @it
domain: World Heritage Site
comment: Relation between World Heritage Site and Town

has Non- Profit Organisation
comment: Relation between World Heritage Site and Non- Profit Organisation
domain: World Heritage Site
range: non-profit organisation
type: ObjectProperty
comment: Relazione tra World Heritage Site e Non- Profit Organisation @it

canal
type: Class

military person
label: militaire @fr
type: Class

has Shopping Mall
range: shopping mall
type: ObjectProperty
comment: Relation between World Heritage Site and Shopping Mall
domain: World Heritage Site
comment: Relazione tra World Heritage Site e Shopping Mall @it

philosopher
label: philosophe @fr
type: Class

award
type: Class
label: récompense @fr

has Basketball Team
range: basketball team
comment: Relation between World Heritage Site and Basketball Team
type: ObjectProperty
comment: Relazione tra World Heritage Site e Basketball Team @it
domain: World Heritage Site

locomotive
type: Class

has Road
comment: Relation between World Heritage Site and Road
type: ObjectProperty
comment: Relazione tra World Heritage Site e Road @it
range: road
domain: World Heritage Site

college
type: Class

has Music Genre
domain: World Heritage Site
type: ObjectProperty
comment: Relation between World Heritage Site and Music Genre
comment: Relazione tra World Heritage Site e Music Genre @it
range: music genre

sport
type: Class

has Planet
range: planet
comment: Relation between World Heritage Site and Planet
type: ObjectProperty
comment: Relazione tra World Heritage Site e Planet @it
domain: World Heritage Site

has Airport
range: airport
comment: Relazione tra World Heritage Site e Airport @it
domain: World Heritage Site
comment: Relation between World Heritage Site and Airport
type: ObjectProperty

single
type: Class

Band
label: groupe de musique @fr
type: Class
label: Musikgruppe @de
label: banda @pt

has Stadium
domain: World Heritage Site
range: stadium
type: ObjectProperty
comment: Relation between World Heritage Site and Stadium
comment: Relazione tra World Heritage Site e Stadium @it

town
type: Class
label: ville @fr

university
type: Class
label: université @fr
label: πανεπιστήμιο @el

has Space Station
range: space station
comment: Relazione tra World Heritage Site e Space Station @it
comment: Relation between World Heritage Site and Space Station
domain: World Heritage Site
type: ObjectProperty

has Basketball League
comment: Relazione tra World Heritage Site e Basketball League @it
range: basketball league
domain: World Heritage Site
comment: Relation between World Heritage Site and Basketball League
type: ObjectProperty

has Member Of Parliament
comment: Relation between World Heritage Site and Member Of Parliament
range: member of parliament
domain: World Heritage Site
type: ObjectProperty
comment: Relazione tra World Heritage Site e Member Of Parliament @it

ethnic group
label: groupe ethnique @fr
type: Class

embryology
type: Class
label: embryologie @fr

has Music Festival
comment: Relazione tra World Heritage Site e Music Festival @it
comment: Relation between World Heritage Site and Music Festival
type: ObjectProperty
domain: World Heritage Site
range: music festival

has Bridge
domain: World Heritage Site
comment: Relazione tra World Heritage Site e Bridge @it
comment: Relation between World Heritage Site and Bridge
range: bridge
type: ObjectProperty

has Hockey Team
range: hockey team
domain: World Heritage Site
type: ObjectProperty
comment: Relazione tra World Heritage Site e Hockey Team @it
comment: Relation between World Heritage Site and Hockey Team

hotel
type: Class
label: hôtel @fr

music festival
type: Class
label: festival de musique @fr

television episode
label: épisode télévisé @fr
type: Class

village
type: Class
label: χωριό @el

ice hockey league
label: ligue d'hockey sur glace @fr
type: Class

has Ice Hockey League
range: ice hockey league
comment: Relazione tra World Heritage Site e Ice Hockey League @it
comment: Relation between World Heritage Site and Ice Hockey League
type: ObjectProperty
domain: World Heritage Site

soccer club
type: Class
label: club de football @fr

historic building
label: bâtiment historique @fr
type: Class

office holder
label: titulaire @fr
label: Amtsinhaber @de
type: Class

website
label: site web @fr
label: Ιστότοπος @el
type: Class

has School
type: ObjectProperty
comment: Relazione tra World Heritage Site e School @it
range: school
comment: Relation between World Heritage Site and School
domain: World Heritage Site

grape
label: raisin @fr
type: Class

has Musical Artist
range: musical artist
domain: World Heritage Site
comment: Relation between World Heritage Site and Musical Artist
comment: Relazione tra World Heritage Site e Musical Artist @it
type: ObjectProperty

has Album
range: album
comment: Relazione tra World Heritage Site e Album @it
comment: Relation between World Heritage Site and Album
domain: World Heritage Site
type: ObjectProperty

has Airline
comment: Relation between World Heritage Site and Airline
domain: World Heritage Site
comment: Relazione tra World Heritage Site e Airline @it
type: ObjectProperty
range: airline

ice hockey player
label: joueur de hockey sur glace @fr
type: Class

has Legislature
range: legislature
domain: World Heritage Site
comment: Relazione tra World Heritage Site e Legislature @it
type: ObjectProperty
comment: Relation between World Heritage Site and Legislature

mountain range
label: chaîne de montagne @fr
type: Class

Christian Bishop
type: Class
label: évêque chrétien @fr

has Historic Building
domain: World Heritage Site
type: ObjectProperty
comment: Relazione tra World Heritage Site e Historic Building @it
range: historic building
comment: Relation between World Heritage Site and Historic Building

has Crustacean
type: ObjectProperty
range: crustacean
domain: World Heritage Site
comment: Relation between World Heritage Site and Crustacean
comment: Relazione tra World Heritage Site e Crustacean @it

has Canal
type: ObjectProperty
comment: Relazione tra World Heritage Site e Canal @it
comment: Relation between World Heritage Site and Canal
range: canal
domain: World Heritage Site

beverage
label: boisson @fr
type: Class

Ontology
comment: WorldHeritageSite Encyclopedic Knowledge Pattern
imports: cpannotationschema.owl
has author: Andrea Giovanni Nuzzolese
has author: Valentina Presutti
extracted from: en.wikipedia.org
extracted from: dbpedia.org
has author: Aldo Gangemi
has intent: To represent the encyclopedic knowledge expressed by an object typed as WorldHeritageSite

has Mollusca
domain: World Heritage Site
range: mollusca
comment: Relazione tra World Heritage Site e Mollusca @it
type: ObjectProperty
comment: Relation between World Heritage Site and Mollusca

has Bone
comment: Relation between World Heritage Site and Bone
range: bone
domain: World Heritage Site
type: ObjectProperty
comment: Relazione tra World Heritage Site e Bone @it

has Conifer
comment: Relation between World Heritage Site and Conifer
range: conifer
comment: Relazione tra World Heritage Site e Conifer @it
type: ObjectProperty
domain: World Heritage Site

planet
label: planète @fr
type: Class

has Protected Area
range: protected area
comment: Relation between World Heritage Site and Protected Area
domain: World Heritage Site
type: ObjectProperty
comment: Relazione tra World Heritage Site e Protected Area @it

scientist
label: scientifique @fr
type: Class
label: Wissenschaftler @de

has Weapon
type: ObjectProperty
domain: World Heritage Site
range: weapon
comment: Relazione tra World Heritage Site e Weapon @it
comment: Relation between World Heritage Site and Weapon

has Book
domain: World Heritage Site
range: book
type: ObjectProperty
comment: Relazione tra World Heritage Site e Book @it
comment: Relation between World Heritage Site and Book

olympics
label: Jeux Olympiques @fr
type: Class

bridge
type: Class
label: pont @fr

has Chemical Compound
range: chemical compound
domain: World Heritage Site
type: ObjectProperty
comment: Relazione tra World Heritage Site e Chemical Compound @it
comment: Relation between World Heritage Site and Chemical Compound

broadcast
label: Émission de télévision @fr
type: Class

has Comedian
comment: Relation between World Heritage Site and Comedian
comment: Relazione tra World Heritage Site e Comedian @it
type: ObjectProperty
range: comedian
domain: World Heritage Site

has Comics Creator
type: ObjectProperty
range: comics creator
domain: World Heritage Site
comment: Relation between World Heritage Site and Comics Creator
comment: Relazione tra World Heritage Site e Comics Creator @it

has Video Game
comment: Relazione tra World Heritage Site e Video Game @it
domain: World Heritage Site
comment: Relation between World Heritage Site and Video Game
range: video game
type: ObjectProperty

island
type: Class
label: νησί @el
label: île @fr

has Senator
range: senator
domain: World Heritage Site
type: ObjectProperty
comment: Relazione tra World Heritage Site e Senator @it
comment: Relation between World Heritage Site and Senator

skyscraper
type: Class
label: gratte-ciel @fr

has Ship
comment: Relazione tra World Heritage Site e Ship @it
domain: World Heritage Site
type: ObjectProperty
range: ship
comment: Relation between World Heritage Site and Ship

has Newspaper
type: ObjectProperty
range: newspaper
domain: World Heritage Site
comment: Relation between World Heritage Site and Newspaper
comment: Relazione tra World Heritage Site e Newspaper @it

bone
label: os @fr
label: Knochen @de
type: Class

member of parliament
type: Class
label: membre du Parlement @fr

conifer
label: conifères @fr
type: Class

airport
label: aéroport @fr
label: Flughafen @de
type: Class