has Newspaper
range: newspaper
domain: wrestling event
type: ObjectProperty
comment: Relazione tra Wrestling Event e Newspaper @it
comment: Relation between Wrestling Event and Newspaper

has Soccer Player
comment: Relation between Wrestling Event and Soccer Player
type: ObjectProperty
comment: Relazione tra Wrestling Event e Soccer Player @it
range: soccer player
domain: wrestling event

has British Royalty
domain: wrestling event
comment: Relazione tra Wrestling Event e British Royalty @it
type: ObjectProperty
comment: Relation between Wrestling Event and British Royalty
range: British royalty

has Continent
domain: wrestling event
comment: Relazione tra Wrestling Event e Continent @it
comment: Relation between Wrestling Event and Continent
range: continent
type: ObjectProperty

disease
type: Class
label: maladie @fr

has Basketball League
comment: Relation between Wrestling Event and Basketball League
type: ObjectProperty
range: basketball league
domain: wrestling event
comment: Relazione tra Wrestling Event e Basketball League @it

has Island
range: island
domain: wrestling event
comment: Relazione tra Wrestling Event e Island @it
comment: Relation between Wrestling Event and Island
type: ObjectProperty

has Bone
range: bone
type: ObjectProperty
domain: wrestling event
comment: Relation between Wrestling Event and Bone
comment: Relazione tra Wrestling Event e Bone @it

has Disease
comment: Relation between Wrestling Event and Disease
domain: wrestling event
comment: Relazione tra Wrestling Event e Disease @it
type: ObjectProperty
range: disease

american football league
type: Class

has American Football Team
type: ObjectProperty
comment: Relation between Wrestling Event and American Football Team
comment: Relazione tra Wrestling Event e American Football Team @it
domain: wrestling event
range: american football team

has Shopping Mall
type: ObjectProperty
comment: Relation between Wrestling Event and Shopping Mall
range: shopping mall
comment: Relazione tra Wrestling Event e Shopping Mall @it
domain: wrestling event

has Baseball League
comment: Relazione tra Wrestling Event e Baseball League @it
domain: wrestling event
comment: Relation between Wrestling Event and Baseball League
type: ObjectProperty
range: baseball league

has Administrative Region
type: ObjectProperty
comment: Relation between Wrestling Event and Administrative Region
comment: Relazione tra Wrestling Event e Administrative Region @it
range: administrative region
domain: wrestling event

american football player
type: Class
label: joueur de football américain @fr

has Magazine
type: ObjectProperty
range: magazine
comment: Relation between Wrestling Event and Magazine
comment: Relazione tra Wrestling Event e Magazine @it
domain: wrestling event

has Website
comment: Relazione tra Wrestling Event e Website @it
range: website
comment: Relation between Wrestling Event and Website
domain: wrestling event
type: ObjectProperty

wrestling event
label: match de catch @fr
type: Class

has Comics Creator
type: ObjectProperty
comment: Relazione tra Wrestling Event e Comics Creator @it
range: comics creator
comment: Relation between Wrestling Event and Comics Creator
domain: wrestling event

basketball league
label: ligue de basketball @fr
type: Class

has Ice Hockey Player
comment: Relazione tra Wrestling Event e Ice Hockey Player @it
domain: wrestling event
range: ice hockey player
type: ObjectProperty
comment: Relation between Wrestling Event and Ice Hockey Player

mayor
type: Class
label: maire @fr

criminal
label: criminel @fr
type: Class

has Music Genre
domain: wrestling event
range: music genre
comment: Relation between Wrestling Event and Music Genre
type: ObjectProperty
comment: Relazione tra Wrestling Event e Music Genre @it

species
type: Class
label: espèce @fr

has Species
domain: wrestling event
range: species
comment: Relation between Wrestling Event and Species
type: ObjectProperty
comment: Relazione tra Wrestling Event e Species @it

has River
type: ObjectProperty
comment: Relazione tra Wrestling Event e River @it
domain: wrestling event
range: river
comment: Relation between Wrestling Event and River

comedian
label: comédien @fr
type: Class

song
label: chanson @fr
type: Class

newspaper
label: journal @fr
type: Class

Playboy Playmate
type: Class
label: playmate pour Playboy @fr

has Film
range: film
comment: Relation between Wrestling Event and Film
domain: wrestling event
type: ObjectProperty
comment: Relazione tra Wrestling Event e Film @it

book
label: llibre @ca
label: książka @pl
label: βιβλίο @el
label: livre @fr
type: Class

boxer
label: boxeur @fr
type: Class

shopping mall
label: centre commercial @fr
type: Class

has Beverage
comment: Relation between Wrestling Event and Beverage
domain: wrestling event
type: ObjectProperty
comment: Relazione tra Wrestling Event e Beverage @it
range: beverage

has Adult Actor
comment: Relation between Wrestling Event and Adult Actor
type: ObjectProperty
domain: wrestling event
range: adult actor
comment: Relazione tra Wrestling Event e Adult Actor @it

has Musical Artist
type: ObjectProperty
comment: Relazione tra Wrestling Event e Musical Artist @it
comment: Relation between Wrestling Event and Musical Artist
range: musical artist
domain: wrestling event

language
type: Class
label: langage @fr

non-profit organisation
label: organisation à but non lucratif @fr
type: Class

arachnid
label: arachnides @fr
type: Class

weapon
label: arme @fr
type: Class

governor
type: Class
label: gouverneur @fr

administrative region
label: région administrative @fr
type: Class

river
type: Class
label: rivière @fr

has Village
range: village
comment: Relation between Wrestling Event and Village
type: ObjectProperty
domain: wrestling event
comment: Relazione tra Wrestling Event e Village @it

has Comics Character
domain: wrestling event
comment: Relation between Wrestling Event and Comics Character
comment: Relazione tra Wrestling Event e Comics Character @it
type: ObjectProperty
range: comics character

magazine
type: Class
label: περιοδικό @el

school
type: Class
label: école @fr

ship
type: Class
label: navire @fr

video game
type: Class
label: jeux vidéo @fr

has Language
comment: Relation between Wrestling Event and Language
comment: Relazione tra Wrestling Event e Language @it
range: language
domain: wrestling event
type: ObjectProperty

has Currency
comment: Relazione tra Wrestling Event e Currency @it
type: ObjectProperty
domain: wrestling event
range: currency
comment: Relation between Wrestling Event and Currency

currency
label: devise @fr
type: Class

British royalty
type: Class
label: royauté Britannique @fr

historic place
type: Class
label: site historique @fr

has Ship
comment: Relazione tra Wrestling Event e Ship @it
type: ObjectProperty
range: ship
domain: wrestling event
comment: Relation between Wrestling Event and Ship

has American Football Player
domain: wrestling event
comment: Relazione tra Wrestling Event e American Football Player @it
type: ObjectProperty
range: american football player
comment: Relation between Wrestling Event and American Football Player

has Military Conflict
range: military conflict
type: ObjectProperty
domain: wrestling event
comment: Relation between Wrestling Event and Military Conflict
comment: Relazione tra Wrestling Event e Military Conflict @it

cricketer
label: joueur de cricket @fr
type: Class

single
type: Class

mixed martial arts event
label: évènement d'arts martiaux mixtes @fr
type: Class

has Boxer
comment: Relazione tra Wrestling Event e Boxer @it
range: boxer
domain: wrestling event
type: ObjectProperty
comment: Relation between Wrestling Event and Boxer

town
type: Class
label: ville @fr

has Playboy Playmate
range: Playboy Playmate
comment: Relazione tra Wrestling Event e Playboy Playmate @it
domain: wrestling event
type: ObjectProperty
comment: Relation between Wrestling Event and Playboy Playmate

university
label: πανεπιστήμιο @el
label: université @fr
type: Class

has Governor
type: ObjectProperty
range: governor
comment: Relazione tra Wrestling Event e Governor @it
comment: Relation between Wrestling Event and Governor
domain: wrestling event

continent
label: ήπειρος @el
type: Class

ethnic group
label: groupe ethnique @fr
type: Class

has Plant
domain: wrestling event
type: ObjectProperty
comment: Relation between Wrestling Event and Plant
comment: Relazione tra Wrestling Event e Plant @it
range: plant

has College Coach
range: college coach
comment: Relazione tra Wrestling Event e College Coach @it
domain: wrestling event
type: ObjectProperty
comment: Relation between Wrestling Event and College Coach

has American Football League
range: american football league
comment: Relation between Wrestling Event and American Football League
domain: wrestling event
type: ObjectProperty
comment: Relazione tra Wrestling Event e American Football League @it

has Basketball Player
domain: wrestling event
comment: Relazione tra Wrestling Event e Basketball Player @it
range: basketball player
comment: Relation between Wrestling Event and Basketball Player
type: ObjectProperty

president
label: président @fr
type: Class

album
type: Class
label: Album @de

has Single
domain: wrestling event
comment: Relation between Wrestling Event and Single
comment: Relazione tra Wrestling Event e Single @it
range: single
type: ObjectProperty

has Historic Place
type: ObjectProperty
comment: Relazione tra Wrestling Event e Historic Place @it
domain: wrestling event
range: historic place
comment: Relation between Wrestling Event and Historic Place

has Video Game
domain: wrestling event
range: video game
comment: Relazione tra Wrestling Event e Video Game @it
type: ObjectProperty
comment: Relation between Wrestling Event and Video Game

military unit
type: Class
label: unité militaire @fr

college coach
label: entraîneur universitaire @fr
type: Class

has Skyscraper
type: ObjectProperty
comment: Relazione tra Wrestling Event e Skyscraper @it
range: skyscraper
comment: Relation between Wrestling Event and Skyscraper
domain: wrestling event

muscle
type: Class

basketball team
type: Class

village
type: Class
label: χωριό @el

has Arachnid
domain: wrestling event
comment: Relazione tra Wrestling Event e Arachnid @it
type: ObjectProperty
comment: Relation between Wrestling Event and Arachnid
range: arachnid

has Town
range: town
comment: Relation between Wrestling Event and Town
type: ObjectProperty
domain: wrestling event
comment: Relazione tra Wrestling Event e Town @it

music genre
type: Class
label: género musical @pt
label: genre musical @fr

has Ethnic Group
comment: Relation between Wrestling Event and Ethnic Group
domain: wrestling event
comment: Relazione tra Wrestling Event e Ethnic Group @it
type: ObjectProperty
range: ethnic group

has Broadcast
comment: Relation between Wrestling Event and Broadcast
domain: wrestling event
comment: Relazione tra Wrestling Event e Broadcast @it
type: ObjectProperty
range: broadcast

has Office Holder
domain: wrestling event
comment: Relation between Wrestling Event and Office Holder
range: office holder
comment: Relazione tra Wrestling Event e Office Holder @it
type: ObjectProperty

has Muscle
type: ObjectProperty
comment: Relation between Wrestling Event and Muscle
comment: Relazione tra Wrestling Event e Muscle @it
range: muscle
domain: wrestling event

baseball player
label: joueur de baseball @fr
type: Class

office holder
type: Class
label: Amtsinhaber @de
label: titulaire @fr

military conflict
type: Class
label: conflit militaire @fr

has School
range: school
comment: Relazione tra Wrestling Event e School @it
type: ObjectProperty
domain: wrestling event
comment: Relation between Wrestling Event and School

website
label: Ιστότοπος @el
label: site web @fr
type: Class

model
type: Class
label: mannequin @fr

Axiom
matching quantification: 1
annotated source: has Mixed Martial Arts Event
annotated target: nextevent

has Chemical Compound
comment: Relation between Wrestling Event and Chemical Compound
range: chemical compound
domain: wrestling event
comment: Relazione tra Wrestling Event e Chemical Compound @it
type: ObjectProperty

has Mixed Martial Arts Event
related match: nextevent
domain: wrestling event
comment: Relazione tra Wrestling Event e Mixed Martial Arts Event @it
comment: Relation between Wrestling Event and Mixed Martial Arts Event
type: ObjectProperty
range: mixed martial arts event

has Non- Profit Organisation
domain: wrestling event
range: non-profit organisation
comment: Relazione tra Wrestling Event e Non- Profit Organisation @it
type: ObjectProperty
comment: Relation between Wrestling Event and Non- Profit Organisation

basketball player
label: joueur de basketball @fr
type: Class

adult actor
label: erwachsener Schauspieler @de
type: Class
label: acteur adulte @fr

has Model
comment: Relation between Wrestling Event and Model
domain: wrestling event
type: ObjectProperty
range: model
comment: Relazione tra Wrestling Event e Model @it

has Album
comment: Relazione tra Wrestling Event e Album @it
type: ObjectProperty
range: album
domain: wrestling event
comment: Relation between Wrestling Event and Album

ice hockey player
label: joueur de hockey sur glace @fr
type: Class

has Baseball Player
comment: Relazione tra Wrestling Event e Baseball Player @it
domain: wrestling event
range: baseball player
type: ObjectProperty
comment: Relation between Wrestling Event and Baseball Player

beverage
type: Class
label: boisson @fr

has President
type: ObjectProperty
comment: Relation between Wrestling Event and President
comment: Relazione tra Wrestling Event e President @it
domain: wrestling event
range: president

comics creator
type: Class
label: créateur de bandes dessinées @fr

Ontology
has author: Valentina Presutti
extracted from: dbpedia.org
extracted from: en.wikipedia.org
imports: cpannotationschema.owl
has author: Aldo Gangemi
comment: WrestlingEvent Encyclopedic Knowledge Pattern
has intent: To represent the encyclopedic knowledge expressed by an object typed as WrestlingEvent
has author: Andrea Giovanni Nuzzolese

hockey team
label: équipe de hockey @fr
type: Class

has Mayor
type: ObjectProperty
range: mayor
comment: Relation between Wrestling Event and Mayor
comment: Relazione tra Wrestling Event e Mayor @it
domain: wrestling event

soccer player
type: Class
label: joueur de football @fr

has Comedian
range: comedian
type: ObjectProperty
comment: Relation between Wrestling Event and Comedian
comment: Relazione tra Wrestling Event e Comedian @it
domain: wrestling event

has Olympics
comment: Relation between Wrestling Event and Olympics
range: olympics
comment: Relazione tra Wrestling Event e Olympics @it
domain: wrestling event
type: ObjectProperty

has Criminal
domain: wrestling event
range: criminal
comment: Relazione tra Wrestling Event e Criminal @it
comment: Relation between Wrestling Event and Criminal
type: ObjectProperty

has Mammal
comment: Relation between Wrestling Event and Mammal
comment: Relazione tra Wrestling Event e Mammal @it
type: ObjectProperty
domain: wrestling event
range: mammal

has Hockey Team
type: ObjectProperty
comment: Relazione tra Wrestling Event e Hockey Team @it
domain: wrestling event
range: hockey team
comment: Relation between Wrestling Event and Hockey Team

olympics
type: Class
label: Jeux Olympiques @fr

has Nascar Driver
comment: Relation between Wrestling Event and Nascar Driver
type: ObjectProperty
domain: wrestling event
comment: Relazione tra Wrestling Event e Nascar Driver @it
range: nascar driver

has Book
range: book
type: ObjectProperty
domain: wrestling event
comment: Relation between Wrestling Event and Book
comment: Relazione tra Wrestling Event e Book @it

baseball league
label: ligue de baseball @fr
type: Class

nascar driver
type: Class
label: pilote de la nascar @fr

has Weapon
comment: Relation between Wrestling Event and Weapon
domain: wrestling event
comment: Relazione tra Wrestling Event e Weapon @it
type: ObjectProperty
range: weapon

plant
type: Class
label: plante @fr

broadcast
label: Émission de télévision @fr
type: Class

has University
range: university
domain: wrestling event
type: ObjectProperty
comment: Relazione tra Wrestling Event e University @it
comment: Relation between Wrestling Event and University

film
label: ταινία @el
type: Class

mammal
label: mammifère @fr
type: Class

american football team
type: Class
label: équipe américaine de football américain @fr

island
label: île @fr
label: νησί @el
type: Class

has Cricketer
domain: wrestling event
comment: Relazione tra Wrestling Event e Cricketer @it
range: cricketer
comment: Relation between Wrestling Event and Cricketer
type: ObjectProperty

comics character
label: personnage de bandes dessinées @fr
type: Class

chemical compound
label: produit chimique @fr
type: Class

skyscraper
label: gratte-ciel @fr
type: Class

has Military Unit
domain: wrestling event
comment: Relation between Wrestling Event and Military Unit
type: ObjectProperty
range: military unit
comment: Relazione tra Wrestling Event e Military Unit @it

bone
label: os @fr
label: Knochen @de
type: Class

musical artist
label: musicien @fr
type: Class
label: artista musical @pt

has Song
comment: Relation between Wrestling Event and Song
domain: wrestling event
comment: Relazione tra Wrestling Event e Song @it
range: song
type: ObjectProperty

has Basketball Team
domain: wrestling event
range: basketball team
type: ObjectProperty
comment: Relazione tra Wrestling Event e Basketball Team @it
comment: Relation between Wrestling Event and Basketball Team