Axiom
dbpedia infobox matching weight: 0.04
annotated target: judges
annotated property: relatedMatch
annotated source: links to Musical Artist

television show
type: Class
label: émission de télévision @fr

Axiom
dbpedia infobox matching weight: 0.67
annotated property: relatedMatch
annotated source: links to Administrative Region
annotated target: resides

Axiom
dbpedia infobox matching weight: 48.91
annotated property: relatedMatch
annotated source: links to Country
annotated target: origin

Axiom
dbpedia infobox matching weight: 77.78
annotated property: relatedMatch
annotated target: associatedActs
annotated source: links to Album

Axiom
dbpedia infobox matching weight: 0.19
annotated source: links to Musical Artist
annotated property: relatedMatch
annotated target: succeeded

Axiom
dbpedia infobox matching weight: 88.89
annotated property: relatedMatch
annotated target: label
annotated source: links to Broadcast

Axiom
dbpedia infobox matching weight: 33.33
annotated property: relatedMatch
annotated source: links to Single
annotated target: years

links to Album
comment: Relazione tra Musical Artist e Album @it
domain: musical artist
range: album
type: ObjectProperty
related match: label
sub property of: work
sub property of: award
related match: associatedActs
type: NamedIndividual
comment: Relation between Musical Artist and Album

Axiom
dbpedia infobox matching weight: 52.46
annotated source: links to City
annotated target: origin
annotated property: relatedMatch

place
type: ObjectProperty
label: περιοχή @el
label: lieu @fr
label: lugar @pt

Axiom
dbpedia infobox matching weight: 0.04
annotated property: relatedMatch
annotated source: links to Musical Artist
annotated target: source

Axiom
dbpedia infobox matching weight: 6.71
annotated source: links to Administrative Region
annotated property: relatedMatch
annotated target: died

Axiom
dbpedia infobox matching weight: 55.56
annotated source: links to Television Show
annotated property: relatedMatch
annotated target: associatedActs

Axiom
dbpedia infobox matching weight: 30.43
annotated property: relatedMatch
annotated target: born
annotated source: links to Country

Axiom
dbpedia infobox matching weight: 33.33
annotated target: associatedActs
annotated property: relatedMatch
annotated source: links to Single

Axiom
dbpedia infobox matching weight: 1.12
annotated source: links to Band
annotated target: before
annotated property: relatedMatch

Axiom
dbpedia infobox matching weight: 4.35
annotated target: died
annotated source: links to Country
annotated property: relatedMatch

Axiom
dbpedia infobox matching weight: 72.37
annotated property: relatedMatch
annotated target: associatedActs
annotated source: links to Musical Artist

Axiom
dbpedia infobox matching weight: 94.8
annotated source: links to Band
annotated target: associatedActs
annotated property: relatedMatch

Axiom
dbpedia infobox matching weight: 1.26
annotated target: after
annotated source: links to Band
annotated property: relatedMatch

Axiom
dbpedia infobox matching weight: 0.07
annotated source: links to Band
annotated target: alias
annotated property: relatedMatch

Axiom
dbpedia infobox matching weight: 0.14
annotated source: links to Record Label
annotated target: associatedActs
annotated property: relatedMatch

Axiom
dbpedia infobox matching weight: 0.82
annotated target: placeOfDeath
annotated source: links to City
annotated property: relatedMatch

links to Magazine
type: ObjectProperty
comment: Relazione tra Musical Artist e Magazine @it
range: magazine
domain: musical artist
comment: Relation between Musical Artist and Magazine
sub property of: work
type: NamedIndividual
related match: label

links to Band
related match: before
type: NamedIndividual
related match: alias
related match: influences
related match: after
related match: relatedActs
related match: associatedActs
type: ObjectProperty
domain: musical artist
comment: Relation between Musical Artist and Band
related match: associatedArtists
sub property of: organisation
related match: title
range: Band
related match: formerActs
comment: Relazione tra Musical Artist e Band @it

Axiom
dbpedia infobox matching weight: 0.05
annotated property: relatedMatch
annotated target: genres
annotated source: links to Music Genre

Axiom
dbpedia infobox matching weight: 0.08
annotated property: relatedMatch
annotated target: type
annotated source: links to Music Genre

device
type: ObjectProperty
label: appareil @fr

Axiom
dbpedia infobox matching weight: 50.0
annotated target: associatedActs
annotated property: relatedMatch
annotated source: links to Film

links to Film
comment: Relation between Musical Artist and Film
sub property of: work
type: NamedIndividual
related match: associatedActs
related match: label
comment: Relazione tra Musical Artist e Film @it
domain: musical artist
type: ObjectProperty
range: film

Axiom
dbpedia infobox matching weight: 0.04
annotated source: links to Musical Artist
annotated property: relatedMatch
annotated target: lastLineUp

Axiom
dbpedia infobox matching weight: 5.74
annotated property: relatedMatch
annotated target: died
annotated source: links to City

Axiom
dbpedia infobox matching weight: 0.83
annotated property: relatedMatch
annotated target: labels
annotated source: links to Record Label

Axiom
dbpedia infobox matching weight: 1.09
annotated property: relatedMatch
annotated target: charti
annotated source: links to Country

administrative region
label: région administrative @fr
type: Class

work
type: ObjectProperty
label: travail @fr
label: obra @pt

Axiom
dbpedia infobox matching weight: 0.23
annotated source: links to Musical Artist
annotated property: relatedMatch
annotated target: regent

Axiom
dbpedia infobox matching weight: 33.33
annotated source: links to Television Show
annotated property: relatedMatch
annotated target: title

Axiom
dbpedia infobox matching weight: 2.36
annotated source: links to Band
annotated target: title
annotated property: relatedMatch

magazine
comment: Magazines, periodicals, glossies or serials are publications, generally published on a regular schedule, containing a variety of articles. They are generally financed by advertising, by a purchase price, by pre-paid magazine subscriptions, or all three.
comment: Als Publikumszeitschrift (auch Magazin) bezeichnet man eine Gattung von Zeitschriften, die sich an eine sehr breite Zielgruppe wendet und keine fachlichen Prägungen oder andere spezifische Merkmale voraussetzt. Publikumszeitschriften dienen der Unterhaltung und Information, sie sollen unangestrengt gelesen werden können.
type: Class
label: περιοδικό @el

country
label: pays @fr
label: Staat @de
label: χώρα @el
type: Class

Axiom
dbpedia infobox matching weight: 1.64
annotated source: links to City
annotated property: relatedMatch
annotated target: placeOfBirth

Axiom
dbpedia infobox matching weight: 13.12
annotated source: links to Musical Artist
annotated target: after
annotated property: relatedMatch

award
type: ObjectProperty
label: récompense @fr

links to Broadcast
range: broadcast
sub property of: organisation
related match: label
comment: Relazione tra Musical Artist e Broadcast @it
domain: musical artist
comment: Relation between Musical Artist and Broadcast
related match: alias
type: NamedIndividual
type: ObjectProperty

Axiom
dbpedia infobox matching weight: 0.04
annotated target: title
annotated property: relatedMatch
annotated source: links to Musical Artist

single
comment: In music, a single or record single is a type of release, typically a recording of fewer tracks than an LP or a CD.
type: Class

Axiom
dbpedia infobox matching weight: 1.09
annotated target: genre
annotated property: relatedMatch
annotated source: links to Country

Band
label: groupe de musique @fr
type: Class
label: Musikgruppe @de
label: banda @pt

university
label: πανεπιστήμιο @el
label: université @fr
type: Class

Axiom
dbpedia infobox matching weight: 0.12
annotated property: relatedMatch
annotated source: links to Musical Artist
annotated target: associatedArtists

links to Administrative Region
type: NamedIndividual
sub property of: place
related match: died
domain: musical artist
range: administrative region
related match: resides
type: ObjectProperty
related match: origin
related match: born
comment: Relazione tra Musical Artist e Administrative Region @it
comment: Relation between Musical Artist and Administrative Region

Axiom
dbpedia infobox matching weight: 0.04
annotated source: links to Musical Artist
annotated property: relatedMatch
annotated target: label

album
label: Album @de
type: Class

Axiom
dbpedia infobox matching weight: 3.26
annotated target: label
annotated property: relatedMatch
annotated source: links to Country

Axiom
dbpedia infobox matching weight: 0.17
annotated source: links to Band
annotated target: influences
annotated property: relatedMatch

person
label: personne @fr
type: ObjectProperty
label: pessoa @pt
label: Person @de

Axiom
dbpedia infobox matching weight: 99.81
annotated property: relatedMatch
annotated target: genre
annotated source: links to Music Genre

Axiom
dbpedia infobox matching weight: 11.11
annotated property: relatedMatch
annotated target: alias
annotated source: links to Broadcast

Axiom
dbpedia infobox matching weight: 0.19
annotated target: preceded
annotated source: links to Musical Artist
annotated property: relatedMatch

Axiom
dbpedia infobox matching weight: 1.09
annotated target: chartb
annotated source: links to Country
annotated property: relatedMatch

Axiom
dbpedia infobox matching weight: 0.05
annotated source: links to Record Label
annotated property: relatedMatch

Axiom
dbpedia infobox matching weight: 46.31
annotated source: links to Administrative Region
annotated property: relatedMatch
annotated target: born

Axiom
dbpedia infobox matching weight: 11.11
annotated target: label
annotated property: relatedMatch
annotated source: links to Television Show

music genre
label: genre musical @fr
type: ObjectProperty
label: género musical @pt
type: Class

links to Television Show
related match: title
type: NamedIndividual
sub property of: work
related match: label
range: television show
related match: associatedActs
domain: musical artist
comment: Relazione tra Musical Artist e Television Show @it
type: ObjectProperty
comment: Relation between Musical Artist and Television Show

links to Single
comment: Relazione tra Musical Artist e Single @it
type: NamedIndividual
related match: notableSongs
range: single
type: ObjectProperty
sub property of: work
comment: Relation between Musical Artist and Single
related match: associatedActs
domain: musical artist
related match: years
sub property of: device

record label
label: label discographique @fr
type: Class

city
comment: a relatively large and permanent settlement, particularly a large urban settlement
label: cité @fr
type: Class

Axiom
dbpedia infobox matching weight: 1.09
annotated property: relatedMatch
annotated target: chartf
annotated source: links to Country

links to Country
type: NamedIndividual
related match: placeOfBirth
related match: chartf
range: country
sub property of: place
related match: genre
related match: label
related match: charth
related match: chartb
type: ObjectProperty
related match: chartg
related match: placeOfDeath
related match: chartj
comment: Relation between Musical Artist and Country
related match: origin
related match: died
related match: charti
comment: Relazione tra Musical Artist e Country @it
domain: musical artist
related match: born

Axiom
dbpedia infobox matching weight: 0.19
annotated source: links to Musical Artist
annotated target: notableInstruments
annotated property: relatedMatch

Axiom
dbpedia infobox matching weight: 33.33
annotated property: relatedMatch
annotated source: links to Single
annotated target: notableSongs

Axiom
dbpedia infobox matching weight: 0.12
annotated target: producer
annotated property: relatedMatch
annotated source: links to Musical Artist

Axiom
dbpedia infobox matching weight: 3.26
annotated property: relatedMatch
annotated source: links to Country
annotated target: placeOfBirth

links to University
comment: Relation between Musical Artist and University
sub property of: organisation
comment: Relazione tra Musical Artist e University @it
type: ObjectProperty
domain: musical artist
range: university

Axiom
dbpedia infobox matching weight: 22.22
annotated target: label
annotated property: relatedMatch
annotated source: links to Album

Axiom
dbpedia infobox matching weight: 1.09
annotated target: chartg
annotated property: relatedMatch
annotated source: links to Country

Axiom
dbpedia infobox matching weight: 1.09
annotated target: chartj
annotated source: links to Country
annotated property: relatedMatch

links to Music Genre
related match: type
range: music genre
type: ObjectProperty
type: NamedIndividual
related match: origin
domain: musical artist
related match: genres
sub property of: music genre
comment: Relation between Musical Artist and Music Genre
related match: genre
comment: Relazione tra Musical Artist e Music Genre @it

Axiom
dbpedia infobox matching weight: 38.52
annotated property: relatedMatch
annotated source: links to City
annotated target: born

Axiom
dbpedia infobox matching weight: 50.0
annotated source: links to Film
annotated target: label
annotated property: relatedMatch

Axiom
dbpedia infobox matching weight: 0.05
annotated property: relatedMatch
annotated source: links to Band
annotated target: associatedArtists

Axiom
dbpedia infobox matching weight: 0.05
annotated property: relatedMatch
annotated source: links to Music Genre
annotated target: origin

Axiom
dbpedia infobox matching weight: 1.09
annotated property: relatedMatch
annotated target: charth
annotated source: links to Country

Axiom
dbpedia infobox matching weight: 0.12
annotated target: relatedActs
annotated property: relatedMatch
annotated source: links to Band

Axiom
dbpedia infobox matching weight: 0.82
annotated property: relatedMatch
annotated target: associatedActs
annotated source: links to City

Axiom
dbpedia infobox matching weight: 12.28
annotated source: links to Musical Artist
annotated target: before
annotated property: relatedMatch

links to City
sub property of: place
related match: born
related match: origin
comment: Relazione tra Musical Artist e City @it
related match: died
related match: placeOfBirth
related match: placeOfDeath
type: ObjectProperty
range: city
domain: musical artist
comment: Relation between Musical Artist and City
type: NamedIndividual
related match: associatedActs

links to Record Label
related match: associatedActs
sub property of: organisation
comment: Relazione tra Musical Artist e Record Label @it
related match: label percent 28s percent 29
type: NamedIndividual
domain: musical artist
type: ObjectProperty
related match: label
range: record label
related match: labels
comment: Relation between Musical Artist and Record Label

Axiom
dbpedia infobox matching weight: 0.04
annotated source: links to Musical Artist
annotated target: birthName
annotated property: relatedMatch

Axiom
dbpedia infobox matching weight: 0.08
annotated source: links to Musical Artist
annotated property: relatedMatch
annotated target: members

organisation
label: Organisation @de
label: organização @pt
type: ObjectProperty

Axiom
dbpedia infobox matching weight: 0.73
annotated source: links to Musical Artist
annotated target: influences
annotated property: relatedMatch

Axiom
dbpedia infobox matching weight: 0.04
annotated property: relatedMatch
annotated source: links to Musical Artist
annotated target: relatedActs

broadcast
label: Émission de télévision @fr
type: Class

film
label: ταινία @el
type: Class

Axiom
dbpedia infobox matching weight: 2.17
annotated property: relatedMatch
annotated target: placeOfDeath
annotated source: links to Country

Axiom
dbpedia infobox matching weight: 0.12
annotated property: relatedMatch
annotated source: links to Musical Artist
annotated target: currentMembers

Axiom
dbpedia infobox matching weight: 0.05
annotated target: formerActs
annotated source: links to Band
annotated property: relatedMatch

Axiom
dbpedia infobox matching weight: 0.09
annotated source: links to Record Label
annotated property: relatedMatch
annotated target: label percent 28s percent 29

Ontology
imports: dbpediainfoboxmatchingweight.owl
has intent: To model the core knowledge needed to describe a MusicalArtist
comment: An encyclopedic knowledge pattern (EKP) identifying the core knowledge that describes a MusicalArtist
extracted from: dbpedia.org
imports: cpannotationschema.owl
extracted from: en.wikipedia.org
has author: Aldo Gangemi
has author: Valentina Presutti
has author: Andrea Giovanni Nuzzolese

Axiom
dbpedia infobox matching weight: 46.31
annotated source: links to Administrative Region
annotated target: origin
annotated property: relatedMatch

Axiom
dbpedia infobox matching weight: 98.9
annotated source: links to Record Label
annotated property: relatedMatch
annotated target: label

musical artist
subclass of: Restriction
  some values from: album
  on property: links to Album
label: musicien @fr
subclass of: Restriction
  on property: links to Record Label
  some values from: record label
subclass of: Restriction
  some values from: administrative region
  on property: links to Administrative Region
subclass of: Restriction
  on property: links to City
  some values from: city
label: artista musical @pt
subclass of: Restriction
  some values from: country
  on property: links to Country
type: Class
subclass of: Restriction
  some values from: music genre
  on property: links to Music Genre
subclass of: Restriction
  some values from: musical artist
  on property: links to Musical Artist
subclass of: Restriction
  on property: links to Band
  some values from: Band

links to Musical Artist
related match: judges
related match: currentMembers
related match: after
type: ObjectProperty
related match: before
related match: associatedArtists
related match: influences
related match: relatedActs
related match: producer
related match: lastLineUp
related match: label
related match: preceded
related match: members
comment: Relazione tra Musical Artist e Musical Artist @it
related match: title
related match: notableInstruments
type: NamedIndividual
related match: birthName
sub property of: person
related match: succeeded
related match: associatedActs
related match: source
range: musical artist
related match: regent
comment: Relation between Musical Artist and Musical Artist
domain: musical artist

Axiom
dbpedia infobox matching weight: 100.0
annotated property: relatedMatch
annotated source: links to Magazine
annotated target: label