has Basketball League
comment: Relazione tra American Football Player e Basketball League @it
type: ObjectProperty
range: basketball league
domain: american football player
comment: Relation between American Football Player and Basketball League

television show
type: Class
label: émission de télévision @fr

has Song
comment: Relazione tra American Football Player e Song @it
type: ObjectProperty
domain: american football player
range: song
comment: Relation between American Football Player and Song

disease
label: maladie @fr
type: Class

has Country
domain: american football player
type: ObjectProperty
comment: Relation between American Football Player and Country
comment: Relazione tra American Football Player e Country @it
range: country

Axiom
annotated target: title
annotated source: has Video Game
matching quantification: 1

colour
label: χρώμα @el
label: couleur @fr
type: Class

automobile
type: Class

Election
type: Class
label: élection @fr

has Album
range: album
domain: american football player
comment: Relation between American Football Player and Album
comment: Relazione tra American Football Player e Album @it
type: ObjectProperty

has Music Genre
comment: Relation between American Football Player and Music Genre
range: music genre
comment: Relazione tra American Football Player e Music Genre @it
type: ObjectProperty
domain: american football player

american football player
type: Class
label: joueur de football américain @fr

has Ice Hockey League
range: ice hockey league
type: ObjectProperty
comment: Relazione tra American Football Player e Ice Hockey League @it
domain: american football player
comment: Relation between American Football Player and Ice Hockey League

stadium
type: Class
label: stade @fr

soccer league
label: ligue de football @fr
type: Class

has Congressman
related match: before
related match: after
range: congressman
comment: Relazione tra American Football Player e Congressman @it
type: ObjectProperty
domain: american football player
comment: Relation between American Football Player and Congressman

Axiom
matching quantification: 2
annotated target: teams
annotated source: has Canadian Football League

astronaut
type: Class
label: Astronaut @de
label: astronaute @fr

wrestler
label: lutteur @fr
type: Class

Axiom
annotated source: has Office Holder
matching quantification: 3
annotated target: after

Axiom
annotated target: highlights
annotated source: has Award
matching quantification: 3

mayor
label: maire @fr
type: Class

has Criminal
type: ObjectProperty
range: criminal
comment: Relazione tra American Football Player e Criminal @it
domain: american football player
comment: Relation between American Football Player and Criminal

pope
type: Class
label: pape @fr

species
label: espèce @fr
type: Class

has Single
comment: Relazione tra American Football Player e Single @it
range: single
domain: american football player
comment: Relation between American Football Player and Single
type: ObjectProperty

has Gaelic Games Player
domain: american football player
comment: Relation between American Football Player and Gaelic Games Player
comment: Relazione tra American Football Player e Gaelic Games Player @it
type: ObjectProperty
range: Gaelic games player

has Continent
comment: Relation between American Football Player and Continent
type: ObjectProperty
domain: american football player
comment: Relazione tra American Football Player e Continent @it
range: continent

newspaper
label: journal @fr
type: Class

has Ski Area
comment: Relation between American Football Player and Ski Area
domain: american football player
comment: Relazione tra American Football Player e Ski Area @it
type: ObjectProperty
range: ski area

has Shopping Mall
domain: american football player
comment: Relation between American Football Player and Shopping Mall
type: ObjectProperty
range: shopping mall
comment: Relazione tra American Football Player e Shopping Mall @it

game
label: jeu @fr
type: Class

protected area
type: Class
label: προστατευμένη περιοχή @el
label: aire protégée @fr

road
label: route @fr
type: Class

Axiom
matching quantification: 1
annotated source: has Cyclist
annotated target: before

has Soccer Player
comment: Relazione tra American Football Player e Soccer Player @it
domain: american football player
range: soccer player
type: ObjectProperty
comment: Relation between American Football Player and Soccer Player

boxer
type: Class
label: boxeur @fr

judge
label: juge @fr
type: Class

World Heritage Site
label: site du patrimoine mondial @fr
type: Class

Axiom
matching quantification: 3
annotated target: after
annotated source: has Congressman

language
type: Class
label: langage @fr

Axiom
matching quantification: 15
annotated target: before
annotated source: has College Coach

has Grand Prix
domain: american football player
comment: Relazione tra American Football Player e Grand Prix @it
type: ObjectProperty
comment: Relation between American Football Player and Grand Prix
range: Grand Prix

lake
type: Class
label: lac @fr

governor
label: gouverneur @fr
type: Class

poker player
label: joueur de poker @fr
type: Class

river
label: rivière @fr
type: Class

has Canadian Football Team
range: canadian football team
comment: Relazione tra American Football Player e Canadian Football Team @it
type: ObjectProperty
comment: Relation between American Football Player and Canadian Football Team
domain: american football player
related match: title
related match: teams

lacrosse league
label: ligue de crosse @fr
type: Class

country
label: pays @fr
label: Staat @de
label: χώρα @el
type: Class

ship
label: navire @fr
type: Class

museum
type: Class
label: musée @fr

fish
type: Class
label: poisson @fr

tennis player
type: Class
label: joueur de tennis @fr

video game
label: jeux vidéo @fr
type: Class

trade union
label: syndicat professionnel @fr
type: Class

Axiom
matching quantification: 2
annotated target: before
annotated source: has Office Holder

has Trade Union
type: ObjectProperty
range: trade union
domain: american football player
comment: Relation between American Football Player and Trade Union
comment: Relazione tra American Football Player e Trade Union @it

currency
label: devise @fr
type: Class

prime minister
label: premier ministre @fr
type: Class

British royalty
label: royauté Britannique @fr
type: Class

has Wrestler
related match: after
type: ObjectProperty
domain: american football player
range: wrestler
comment: Relation between American Football Player and Wrestler
comment: Relazione tra American Football Player e Wrestler @it

historic place
label: site historique @fr
type: Class

has Species
domain: american football player
comment: Relation between American Football Player and Species
range: species
type: ObjectProperty
comment: Relazione tra American Football Player e Species @it

hospital
type: Class
label: hôpital @fr

has Radio Station
type: ObjectProperty
range: radio station
domain: american football player
comment: Relation between American Football Player and Radio Station
comment: Relazione tra American Football Player e Radio Station @it

has Baseball League
domain: american football player
type: ObjectProperty
comment: Relation between American Football Player and Baseball League
range: baseball league
comment: Relazione tra American Football Player e Baseball League @it

has Colour
comment: Relazione tra American Football Player e Colour @it
comment: Relation between American Football Player and Colour
range: colour
domain: american football player
type: ObjectProperty

has Ice Hockey Player
range: ice hockey player
domain: american football player
type: ObjectProperty
comment: Relazione tra American Football Player e Ice Hockey Player @it
comment: Relation between American Football Player and Ice Hockey Player

has Broadcast
range: broadcast
domain: american football player
type: ObjectProperty
comment: Relation between American Football Player and Broadcast
comment: Relazione tra American Football Player e Broadcast @it

continent
label: ήπειρος @el
type: Class

Axiom
annotated target: years
annotated source: has Military Person
matching quantification: 1

Axiom
annotated source: has Tennis Player
annotated target: years
matching quantification: 1

has National Collegiate Athletic Association Athlete
related match: after
related match: before
range: national collegiate athletic association athlete
comment: Relazione tra American Football Player e National Collegiate Athletic Association Athlete @it
type: ObjectProperty
domain: american football player
comment: Relation between American Football Player and National Collegiate Athletic Association Athlete

president
label: président @fr
type: Class

album
type: Class
label: Album @de

figure skater
label: patineur artistique @fr
type: Class

military unit
type: Class
label: unité militaire @fr

Axiom
annotated target: after
matching quantification: 39
annotated source: has College Coach

has Protected Area
type: ObjectProperty
comment: Relation between American Football Player and Protected Area
domain: american football player
comment: Relazione tra American Football Player e Protected Area @it
range: protected area

soccer manager
type: Class
label: entraîneur de football @fr

basketball team
type: Class

has Governor
range: governor
type: ObjectProperty
domain: american football player
comment: Relazione tra American Football Player e Governor @it
comment: Relation between American Football Player and Governor

has Senator
comment: Relazione tra American Football Player e Senator @it
range: senator
comment: Relation between American Football Player and Senator
domain: american football player
type: ObjectProperty

canadian football team
label: équipe canadienne de football américain @fr
type: Class

music genre
type: Class
label: género musical @pt
label: genre musical @fr

has Journalist
comment: Relation between American Football Player and Journalist
type: ObjectProperty
domain: american football player
comment: Relazione tra American Football Player e Journalist @it
range: journalist

writer
type: Class
label: écrivain @fr

record label
type: Class
label: label discographique @fr

has Insect
comment: Relation between American Football Player and Insect
range: insect
domain: american football player
comment: Relazione tra American Football Player e Insect @it
type: ObjectProperty

architect
label: architecte @fr
type: Class

Axiom
annotated target: college
matching quantification: 2
annotated source: has Historic Place

model
type: Class
label: mannequin @fr

has Video Game
related match: title
range: video game
comment: Relation between American Football Player and Video Game
type: ObjectProperty
domain: american football player
comment: Relazione tra American Football Player e Video Game @it

Axiom
annotated source: has Military Person
matching quantification: 4
annotated target: before

film festival
label: festival du film @fr
type: Class

Axiom
matching quantification: 1
annotated target: regent
annotated source: has Office Holder

has Website
range: website
type: ObjectProperty
comment: Relation between American Football Player and Website
domain: american football player
comment: Relazione tra American Football Player e Website @it

Ontology
has author: Aldo Gangemi
imports: cpannotationschema.owl
comment: AmericanFootballPlayer Encyclopedic Knowledge Pattern
extracted from: en.wikipedia.org
has intent: To represent the encyclopedic knowledge expressed by an object typed as AmericanFootballPlayer
extracted from: dbpedia.org
has author: Valentina Presutti
has author: Andrea Giovanni Nuzzolese

has Boxer
range: boxer
comment: Relazione tra American Football Player e Boxer @it
domain: american football player
type: ObjectProperty
comment: Relation between American Football Player and Boxer

has Restaurant
range: restaurant
comment: Relation between American Football Player and Restaurant
comment: Relazione tra American Football Player e Restaurant @it
type: ObjectProperty
domain: american football player

Grand Prix
type: Class
label: grand prix @fr

Axiom
annotated source: has Baseball Player
annotated target: after
matching quantification: 7

aircraft
label: αεροσκάφος @el
type: Class
label: avion @fr

Axiom
matching quantification: 1
annotated source: has Astronaut
annotated target: before

Axiom
annotated source: has National Collegiate Athletic Association Athlete
matching quantification: 2
annotated target: before

hockey team
label: équipe de hockey @fr
type: Class

Axiom
annotated target: after
annotated source: has National Collegiate Athletic Association Athlete
matching quantification: 7

soccer player
type: Class
label: joueur de football @fr

reptile
type: Class

has Olympics
type: ObjectProperty
comment: Relazione tra American Football Player e Olympics @it
comment: Relation between American Football Player and Olympics
domain: american football player
range: olympics

legislature
label: pouvoir législatif @fr
type: Class

Axiom
annotated source: has Canadian Football Team
annotated target: teams
matching quantification: 8

has Book
type: ObjectProperty
comment: Relation between American Football Player and Book
comment: Relazione tra American Football Player e Book @it
domain: american football player
range: book

has Protein
comment: Relazione tra American Football Player e Protein @it
domain: american football player
type: ObjectProperty
comment: Relation between American Football Player and Protein
range: protein

airline
label: compagnie aérienne @fr
type: Class

has Brain
type: ObjectProperty
domain: american football player
range: brain
comment: Relation between American Football Player and Brain
comment: Relazione tra American Football Player e Brain @it

congressman
label: membre du Congrès @fr
type: Class

golf player
label: golfeur @fr
type: Class

nascar driver
type: Class
label: pilote de la nascar @fr

has Grape
comment: Relation between American Football Player and Grape
domain: american football player
comment: Relazione tra American Football Player e Grape @it
range: grape
type: ObjectProperty

space mission
type: Class
label: διαστημική αποστολή @el
label: mission spatiale @fr

journalist
type: Class
label: journaliste @fr

has Comics Character
range: comics character
type: ObjectProperty
comment: Relazione tra American Football Player e Comics Character @it
domain: american football player
comment: Relation between American Football Player and Comics Character

Axiom
annotated source: has Tennis Player
annotated target: before
matching quantification: 1

Axiom
annotated target: after
annotated source: has Military Person
matching quantification: 2

insect
type: Class
label: insecte @fr

has Astronaut
related match: years
related match: before
comment: Relazione tra American Football Player e Astronaut @it
type: ObjectProperty
domain: american football player
comment: Relation between American Football Player and Astronaut
range: astronaut

film
label: ταινία @el
type: Class

has Prime Minister
type: ObjectProperty
comment: Relation between American Football Player and Prime Minister
comment: Relazione tra American Football Player e Prime Minister @it
range: prime minister
domain: american football player

Supreme Court of the United States case
type: Class
label: cas juridique de la Cour suprême des États-Unis @fr

has Music Festival
comment: Relazione tra American Football Player e Music Festival @it
type: ObjectProperty
domain: american football player
range: music festival
comment: Relation between American Football Player and Music Festival

Axiom
annotated source: has Basketball Player
matching quantification: 5
annotated target: years

has Chemical Compound
range: chemical compound
domain: american football player
comment: Relation between American Football Player and Chemical Compound
comment: Relazione tra American Football Player e Chemical Compound @it
type: ObjectProperty

bird
type: Class
label: oiseau @fr

chemical compound
type: Class
label: produit chimique @fr

has Rugby Player
range: rugby player
comment: Relazione tra American Football Player e Rugby Player @it
comment: Relation between American Football Player and Rugby Player
type: ObjectProperty
domain: american football player

Axiom
matching quantification: 16
annotated source: has Award
annotated target: title

has Bridge
comment: Relation between American Football Player and Bridge
range: bridge
type: ObjectProperty
domain: american football player
comment: Relazione tra American Football Player e Bridge @it

Gaelic games player
type: Class
label: joueur de sports gaéliques @fr

musical artist
label: musicien @fr
type: Class
label: artista musical @pt

has Architect
range: architect
comment: Relazione tra American Football Player e Architect @it
domain: american football player
comment: Relation between American Football Player and Architect
type: ObjectProperty

has Nerve
comment: Relazione tra American Football Player e Nerve @it
domain: american football player
range: nerve
comment: Relation between American Football Player and Nerve
type: ObjectProperty

has Village
comment: Relation between American Football Player and Village
type: ObjectProperty
domain: american football player
range: village
comment: Relazione tra American Football Player e Village @it

has Space Mission
comment: Relazione tra American Football Player e Space Mission @it
comment: Relation between American Football Player and Space Mission
range: space mission
domain: american football player
type: ObjectProperty

has Skyscraper
comment: Relazione tra American Football Player e Skyscraper @it
comment: Relation between American Football Player and Skyscraper
range: skyscraper
domain: american football player
type: ObjectProperty

has Military Person
related match: before
related match: years
related match: after
comment: Relation between American Football Player and Military Person
comment: Relazione tra American Football Player e Military Person @it
domain: american football player
range: military person
type: ObjectProperty

has Comedian
type: ObjectProperty
domain: american football player
range: comedian
comment: Relazione tra American Football Player e Comedian @it
comment: Relation between American Football Player and Comedian

has Language
type: ObjectProperty
comment: Relation between American Football Player and Language
range: language
comment: Relazione tra American Football Player e Language @it
domain: american football player

brain
label: cerveau @fr
type: Class

has Musical Artist
comment: Relation between American Football Player and Musical Artist
comment: Relazione tra American Football Player e Musical Artist @it
domain: american football player
type: ObjectProperty
range: musical artist

has Currency
type: ObjectProperty
range: currency
comment: Relazione tra American Football Player e Currency @it
comment: Relation between American Football Player and Currency
domain: american football player

rugby player
label: joueur de rugby @fr
type: Class

has Canadian Football League
domain: american football player
comment: Relation between American Football Player and Canadian Football League
range: canadian football league
type: ObjectProperty
comment: Relazione tra American Football Player e Canadian Football League @it
related match: teams

has Newspaper
comment: Relation between American Football Player and Newspaper
range: newspaper
domain: american football player
type: ObjectProperty
comment: Relazione tra American Football Player e Newspaper @it

has Game
comment: Relation between American Football Player and Game
type: ObjectProperty
range: game
domain: american football player
comment: Relazione tra American Football Player e Game @it

has Film
comment: Relazione tra American Football Player e Film @it
comment: Relation between American Football Player and Film
type: ObjectProperty
range: film
domain: american football player

has Adult Actor
comment: Relation between American Football Player and Adult Actor
comment: Relazione tra American Football Player e Adult Actor @it
range: adult actor
domain: american football player
type: ObjectProperty

has Model
comment: Relazione tra American Football Player e Model @it
range: model
type: ObjectProperty
comment: Relation between American Football Player and Model
domain: american football player

has Drug
comment: Relazione tra American Football Player e Drug @it
domain: american football player
comment: Relation between American Football Player and Drug
type: ObjectProperty
range: drug

musical
type: Class
label: musique @fr

has Fish
domain: american football player
comment: Relation between American Football Player and Fish
comment: Relazione tra American Football Player e Fish @it
range: fish
type: ObjectProperty

Axiom
annotated target: after
matching quantification: 1
annotated source: has Wrestler

has Mountain
comment: Relazione tra American Football Player e Mountain @it
type: ObjectProperty
comment: Relation between American Football Player and Mountain
domain: american football player
range: mountain

cyclist
type: Class
label: cycliste @fr

has College Coach
related match: before
related match: after
comment: Relazione tra American Football Player e College Coach @it
range: college coach
type: ObjectProperty
domain: american football player
comment: Relation between American Football Player and College Coach

national collegiate athletic association athlete
type: Class
label: athlète de la national collegiate athletic association @fr

has President
range: president
comment: Relazione tra American Football Player e President @it
comment: Relation between American Football Player and President
domain: american football player
type: ObjectProperty

wrestling event
type: Class
label: match de catch @fr

has Muscle
comment: Relation between American Football Player and Muscle
type: ObjectProperty
domain: american football player
range: muscle
comment: Relazione tra American Football Player e Muscle @it

has Ship
domain: american football player
comment: Relazione tra American Football Player e Ship @it
range: ship
type: ObjectProperty
comment: Relation between American Football Player and Ship

has Town
related match: birthplace
comment: Relazione tra American Football Player e Town @it
comment: Relation between American Football Player and Town
range: town
domain: american football player
type: ObjectProperty

basketball league
type: Class
label: ligue de basketball @fr

mountain
label: Βουνό @el
label: montagne @fr
type: Class

has Mammal
range: mammal
type: ObjectProperty
comment: Relation between American Football Player and Mammal
comment: Relazione tra American Football Player e Mammal @it
domain: american football player

has Reptile
range: reptile
domain: american football player
comment: Relation between American Football Player and Reptile
type: ObjectProperty
comment: Relazione tra American Football Player e Reptile @it

criminal
label: criminel @fr
type: Class

has Award
related match: title
related match: highlights
range: award
comment: Relazione tra American Football Player e Award @it
type: ObjectProperty
domain: american football player
comment: Relation between American Football Player and Award

has Lake
domain: american football player
range: lake
type: ObjectProperty
comment: Relation between American Football Player and Lake
comment: Relazione tra American Football Player e Lake @it

has World Heritage Site
type: ObjectProperty
comment: Relation between American Football Player and World Heritage Site
range: World Heritage Site
comment: Relazione tra American Football Player e World Heritage Site @it
domain: american football player

senator
label: sénateur @fr
type: Class

saint
type: Class

has Soccer League
range: soccer league
comment: Relazione tra American Football Player e Soccer League @it
type: ObjectProperty
comment: Relation between American Football Player and Soccer League
domain: american football player

comedian
type: Class
label: comédien @fr

has Television Episode
range: television episode
comment: Relazione tra American Football Player e Television Episode @it
domain: american football player
comment: Relation between American Football Player and Television Episode
type: ObjectProperty

Axiom
matching quantification: 1
annotated target: years
annotated source: has Astronaut

song
label: chanson @fr
type: Class

Playboy Playmate
type: Class
label: playmate pour Playboy @fr

has Military Unit
comment: Relazione tra American Football Player e Military Unit @it
type: ObjectProperty
comment: Relation between American Football Player and Military Unit
domain: american football player
range: military unit

book
type: Class
label: livre @fr
label: βιβλίο @el
label: książka @pl
label: llibre @ca

has Soccer Club
comment: Relazione tra American Football Player e Soccer Club @it
range: soccer club
domain: american football player
type: ObjectProperty
comment: Relation between American Football Player and Soccer Club

has Island
related match: countryofbirth
type: ObjectProperty
comment: Relazione tra American Football Player e Island @it
comment: Relation between American Football Player and Island
domain: american football player
range: island

has Hospital
comment: Relation between American Football Player and Hospital
type: ObjectProperty
comment: Relazione tra American Football Player e Hospital @it
domain: american football player
range: hospital

shopping mall
label: centre commercial @fr
type: Class

has Mayor
range: mayor
domain: american football player
type: ObjectProperty
comment: Relation between American Football Player and Mayor
comment: Relazione tra American Football Player e Mayor @it

Axiom
annotated source: has Town
annotated target: birthplace
matching quantification: 1

has Band
range: Band
type: ObjectProperty
comment: Relazione tra American Football Player e Band @it
domain: american football player
comment: Relation between American Football Player and Band

has Office Holder
related match: before
related match: years
range: office holder
comment: Relation between American Football Player and Office Holder
related match: regent
related match: after
domain: american football player
comment: Relazione tra American Football Player e Office Holder @it
type: ObjectProperty

ski area
type: Class
label: domaine skiable @fr

non-profit organisation
type: Class
label: organisation à but non lucratif @fr

has Military Conflict
domain: american football player
range: military conflict
comment: Relazione tra American Football Player e Military Conflict @it
type: ObjectProperty
comment: Relation between American Football Player and Military Conflict

canadian football league
type: Class

has Bone
comment: Relazione tra American Football Player e Bone @it
domain: american football player
type: ObjectProperty
comment: Relation between American Football Player and Bone
range: bone

has Figure Skater
range: figure skater
type: ObjectProperty
comment: Relation between American Football Player and Figure Skater
comment: Relazione tra American Football Player e Figure Skater @it
domain: american football player

has Museum
type: ObjectProperty
range: museum
comment: Relation between American Football Player and Museum
comment: Relazione tra American Football Player e Museum @it
domain: american football player

has Stadium
range: stadium
type: ObjectProperty
comment: Relazione tra American Football Player e Stadium @it
comment: Relation between American Football Player and Stadium
domain: american football player

has Historic Place
comment: Relation between American Football Player and Historic Place
range: historic place
comment: Relazione tra American Football Player e Historic Place @it
type: ObjectProperty
domain: american football player
related match: college

weapon
label: arme @fr
type: Class

has Cricketer
type: ObjectProperty
comment: Relazione tra American Football Player e Cricketer @it
range: cricketer
domain: american football player
comment: Relation between American Football Player and Cricketer

drug
label: médicament @fr
type: Class

has Film Festival
range: film festival
comment: Relazione tra American Football Player e Film Festival @it
comment: Relation between American Football Player and Film Festival
domain: american football player
type: ObjectProperty

magazine
type: Class
label: περιοδικό @el

has Baseball Player
related match: after
related match: before
domain: american football player
comment: Relazione tra American Football Player e Baseball Player @it
comment: Relation between American Football Player and Baseball Player
range: baseball player
type: ObjectProperty

military person
label: militaire @fr
type: Class

award
type: Class
label: récompense @fr

has Golf Player
related match: before
related match: after
type: ObjectProperty
range: golf player
domain: american football player
comment: Relazione tra American Football Player e Golf Player @it
comment: Relation between American Football Player and Golf Player

Axiom
annotated target: after
matching quantification: 7
annotated source: has Basketball Player

college
type: Class

restaurant
type: Class

cricketer
label: joueur de cricket @fr
type: Class

nerve
label: nerf @fr
type: Class

single
type: Class

has Historic Building
range: historic building
comment: Relazione tra American Football Player e Historic Building @it
comment: Relation between American Football Player and Historic Building
type: ObjectProperty
domain: american football player

mixed martial arts event
type: Class
label: évènement d'arts martiaux mixtes @fr

Band
label: groupe de musique @fr
type: Class
label: Musikgruppe @de
label: banda @pt

has Hockey Team
range: hockey team
comment: Relazione tra American Football Player e Hockey Team @it
domain: american football player
comment: Relation between American Football Player and Hockey Team
type: ObjectProperty

town
type: Class
label: ville @fr

has Saint
type: ObjectProperty
comment: Relazione tra American Football Player e Saint @it
domain: american football player
range: saint
comment: Relation between American Football Player and Saint

Axiom
matching quantification: 5
annotated target: after
annotated source: has Golf Player

has Television Show
comment: Relation between American Football Player and Television Show
range: television show
domain: american football player
type: ObjectProperty
comment: Relazione tra American Football Player e Television Show @it

protein
label: protéine @fr
type: Class

ethnic group
label: groupe ethnique @fr
type: Class

has Airline
range: airline
type: ObjectProperty
domain: american football player
comment: Relation between American Football Player and Airline
comment: Relazione tra American Football Player e Airline @it

has Road
type: ObjectProperty
comment: Relation between American Football Player and Road
comment: Relazione tra American Football Player e Road @it
range: road
domain: american football player

has Lacrosse League
domain: american football player
range: lacrosse league
type: ObjectProperty
comment: Relation between American Football Player and Lacrosse League
comment: Relazione tra American Football Player e Lacrosse League @it

has Judge
comment: Relazione tra American Football Player e Judge @it
comment: Relation between American Football Player and Judge
range: judge
domain: american football player
type: ObjectProperty

artery
label: Arterie @de
type: Class
label: artère @fr

Axiom
annotated target: before
matching quantification: 2
annotated source: has Golf Player

has Poker Player
domain: american football player
range: poker player
comment: Relation between American Football Player and Poker Player
comment: Relazione tra American Football Player e Poker Player @it
type: ObjectProperty

music festival
label: festival de musique @fr
type: Class

Axiom
annotated source: has Congressman
matching quantification: 2
annotated target: before

college coach
label: entraîneur universitaire @fr
type: Class

television episode
label: épisode télévisé @fr
type: Class

has Automobile
domain: american football player
range: automobile
comment: Relazione tra American Football Player e Automobile @it
comment: Relation between American Football Player and Automobile
type: ObjectProperty

muscle
type: Class

has Scientist
type: ObjectProperty
range: scientist
domain: american football player
comment: Relation between American Football Player and Scientist
comment: Relazione tra American Football Player e Scientist @it

village
type: Class
label: χωριό @el

has Election
range: Election
comment: Relation between American Football Player and Election
domain: american football player
type: ObjectProperty
comment: Relazione tra American Football Player e Election @it

ice hockey league
label: ligue d'hockey sur glace @fr
type: Class

has Ethnic Group
comment: Relation between American Football Player and Ethnic Group
comment: Relazione tra American Football Player e Ethnic Group @it
type: ObjectProperty
range: ethnic group
domain: american football player

soccer club
type: Class
label: club de football @fr

has Magazine
comment: Relazione tra American Football Player e Magazine @it
domain: american football player
range: magazine
comment: Relation between American Football Player and Magazine
type: ObjectProperty

has Nascar Driver
comment: Relazione tra American Football Player e Nascar Driver @it
range: nascar driver
comment: Relation between American Football Player and Nascar Driver
type: ObjectProperty
domain: american football player

has Legislature
comment: Relazione tra American Football Player e Legislature @it
type: ObjectProperty
range: legislature
domain: american football player
comment: Relation between American Football Player and Legislature

historic building
label: bâtiment historique @fr
type: Class

baseball player
label: joueur de baseball @fr
type: Class

office holder
type: Class
label: Amtsinhaber @de
label: titulaire @fr

military conflict
type: Class
label: conflit militaire @fr

website
label: site web @fr
label: Ιστότοπος @el
type: Class

has Formula One Racer
range: Formula One racer
comment: Relazione tra American Football Player e Formula One Racer @it
type: ObjectProperty
comment: Relation between American Football Player and Formula One Racer
domain: american football player

grape
type: Class
label: raisin @fr

has Wrestling Event
domain: american football player
range: wrestling event
type: ObjectProperty
comment: Relazione tra American Football Player e Wrestling Event @it
comment: Relation between American Football Player and Wrestling Event

has Non- Profit Organisation
comment: Relazione tra American Football Player e Non- Profit Organisation @it
type: ObjectProperty
comment: Relation between American Football Player and Non- Profit Organisation
range: non-profit organisation
domain: american football player

has Mixed Martial Arts Event
range: mixed martial arts event
domain: american football player
comment: Relation between American Football Player and Mixed Martial Arts Event
type: ObjectProperty
comment: Relazione tra American Football Player e Mixed Martial Arts Event @it

basketball player
label: joueur de basketball @fr
type: Class

has Supreme Court Of The United States Case
type: ObjectProperty
comment: Relazione tra American Football Player e Supreme Court Of The United States Case @it
domain: american football player
comment: Relation between American Football Player and Supreme Court Of The United States Case
range: Supreme Court of the United States case

adult actor
label: acteur adulte @fr
type: Class
label: erwachsener Schauspieler @de

Axiom
annotated source: has Canadian Football Team
annotated target: title
matching quantification: 1

has Disease
comment: Relation between American Football Player and Disease
range: disease
domain: american football player
type: ObjectProperty
comment: Relazione tra American Football Player e Disease @it

ice hockey player
label: joueur de hockey sur glace @fr
type: Class

has British Royalty
range: British royalty
type: ObjectProperty
domain: american football player
comment: Relazione tra American Football Player e British Royalty @it
comment: Relation between American Football Player and British Royalty

has Basketball Player
related match: years
related match: after
related match: before
comment: Relazione tra American Football Player e Basketball Player @it
type: ObjectProperty
domain: american football player
comment: Relation between American Football Player and Basketball Player
range: basketball player

has Basketball Team
domain: american football player
comment: Relation between American Football Player and Basketball Team
type: ObjectProperty
comment: Relazione tra American Football Player e Basketball Team @it
range: basketball team

has Bird
type: ObjectProperty
domain: american football player
range: bird
comment: Relazione tra American Football Player e Bird @it
comment: Relation between American Football Player and Bird

beverage
label: boisson @fr
type: Class

has Cyclist
related match: before
range: cyclist
comment: Relation between American Football Player and Cyclist
comment: Relazione tra American Football Player e Cyclist @it
domain: american football player
type: ObjectProperty

has River
domain: american football player
type: ObjectProperty
comment: Relazione tra American Football Player e River @it
range: river
comment: Relation between American Football Player and River

has Musical
domain: american football player
type: ObjectProperty
range: musical
comment: Relazione tra American Football Player e Musical @it
comment: Relation between American Football Player and Musical

has Soccer Manager
comment: Relation between American Football Player and Soccer Manager
comment: Relazione tra American Football Player e Soccer Manager @it
type: ObjectProperty
range: soccer manager
domain: american football player

has Airport
type: ObjectProperty
range: airport
comment: Relazione tra American Football Player e Airport @it
domain: american football player
comment: Relation between American Football Player and Airport

has Tennis Player
comment: Relation between American Football Player and Tennis Player
domain: american football player
range: tennis player
comment: Relazione tra American Football Player e Tennis Player @it
type: ObjectProperty
related match: years
related match: before

scientist
label: Wissenschaftler @de
type: Class
label: scientifique @fr

has Pope
comment: Relazione tra American Football Player e Pope @it
comment: Relation between American Football Player and Pope
range: pope
type: ObjectProperty
domain: american football player

has Writer
domain: american football player
comment: Relazione tra American Football Player e Writer @it
range: writer
comment: Relation between American Football Player and Writer
type: ObjectProperty

Axiom
annotated target: years
matching quantification: 4
annotated source: has Office Holder

has Record Label
comment: Relazione tra American Football Player e Record Label @it
range: record label
type: ObjectProperty
comment: Relation between American Football Player and Record Label
domain: american football player

olympics
label: Jeux Olympiques @fr
type: Class

Axiom
matching quantification: 1
annotated source: has Island
annotated target: countryofbirth

has Artery
comment: Relazione tra American Football Player e Artery @it
domain: american football player
comment: Relation between American Football Player and Artery
type: ObjectProperty
range: artery

baseball league
label: ligue de baseball @fr
type: Class

Axiom
annotated target: before
annotated source: has Basketball Player
matching quantification: 6

has Aircraft
domain: american football player
range: aircraft
comment: Relation between American Football Player and Aircraft
comment: Relazione tra American Football Player e Aircraft @it
type: ObjectProperty

bridge
type: Class
label: pont @fr

broadcast
type: Class
label: Émission de télévision @fr

has College
range: college
comment: Relation between American Football Player and College
comment: Relazione tra American Football Player e College @it
domain: american football player
type: ObjectProperty

mammal
label: mammifère @fr
type: Class

has Weapon
comment: Relation between American Football Player and Weapon
domain: american football player
range: weapon
comment: Relazione tra American Football Player e Weapon @it
type: ObjectProperty

island
label: île @fr
label: νησί @el
type: Class

comics character
type: Class
label: personnage de bandes dessinées @fr

Axiom
matching quantification: 4
annotated target: before
annotated source: has Baseball Player

skyscraper
type: Class
label: gratte-ciel @fr

Formula One racer
label: pilote de formule 1 @fr
type: Class

radio station
label: station de radio @fr
type: Class

has Playboy Playmate
type: ObjectProperty
comment: Relation between American Football Player and Playboy Playmate
domain: american football player
range: Playboy Playmate
comment: Relazione tra American Football Player e Playboy Playmate @it

bone
type: Class
label: Knochen @de
label: os @fr

has Beverage
type: ObjectProperty
comment: Relazione tra American Football Player e Beverage @it
comment: Relation between American Football Player and Beverage
domain: american football player
range: beverage

airport
type: Class
label: Flughafen @de
label: aéroport @fr